[pve-devel] make error in libqb/trunk

Seth Lauzon seth.lauzon at gmail.com
Tue Jun 28 18:39:05 CEST 2011


PASS: array.test
PASS: rb.test
PASS: log.test
PASS: loop.test
FAIL: ipc.test
FAIL: resources.test
===================================================
2 of 6 tests failed
See tests/test-suite.log
Please report to quarterback-devel at fedorahosted.org
===================================================
make[6]: *** [test-suite.log] Error 1
make[6]: Leaving directory `/usr/local/src/pve/libqb/trunk/libqb-0.5.0/tests'
make[5]: *** [check-TESTS] Error 2
make[5]: Leaving directory `/usr/local/src/pve/libqb/trunk/libqb-0.5.0/tests'
make[4]: *** [check-am] Error 2
make[4]: Leaving directory `/usr/local/src/pve/libqb/trunk/libqb-0.5.0/tests'
make[3]: *** [check-recursive] Error 1
make[3]: Leaving directory `/usr/local/src/pve/libqb/trunk/libqb-0.5.0'
make[2]: *** [check] Error 2
make[2]: Leaving directory `/usr/local/src/pve/libqb/trunk/libqb-0.5.0'
dh_auto_test: make -j1 check returned exit code 2
make[1]: *** [build] Error 29
make[1]: Leaving directory `/usr/local/src/pve/libqb/trunk/libqb-0.5.0'
dpkg-buildpackage: error: debian/rules build gave error exit status 2
make: *** [libqb_0.5.0-1_amd64.deb] Error 2

=============================================
   libqb 0.5.0.2-42e7: tests/test-suite.log
==============================================

2 of 6 tests failed.

.. contents:: :depth: 2


FAIL: ipc.test (exit: 1)
========================

Running suite(s): ipc
[info] server name: test_ipc_txrx_shm_block
[info] IPC credentials authenticated
[info] server name: test_ipc_txrx_shm_tmo
[info] IPC credentials authenticated
[info] server name: test_ipc_txrx_us_block
[info] IPC credentials authenticated
[info] server name: test_ipc_txrx_us_tmo
[info] IPC credentials authenticated
[info] server name: test_ipc_fc_shm
[info] IPC credentials authenticated
[info] server name: test_ipc_fc_us
[info] IPC credentials authenticated
[info] server name: test_ipc_txrx_pmq
[info] IPC credentials authenticated
[info] server name: test_ipc_txrx_smq
[info] IPC credentials authenticated
[info] qb_ipcc_send: Invalid argument (22)
[info] server name: test_ipc_disp_shm
[info] IPC credentials authenticated
[info] server name: test_ipc_disp_us
[info] IPC credentials authenticated
[info] qb_ipcs_event_send: Socket operation on non-socket (88)
90%: Checks: 10, Failures: 0, Errors: 1
check_ipc.c:273:P:ipc_txrx_shm_block:test_ipc_txrx_shm_block:0: Passed
check_ipc.c:273:P:ipc_txrx_shm_tmo:test_ipc_txrx_shm_tmo:0: Passed
check_ipc.c:273:P:ipc_txrx_us_block:test_ipc_txrx_us_block:0: Passed
check_ipc.c:273:P:ipc_txrx_us_tmo:test_ipc_txrx_us_tmo:0: Passed
check_ipc.c:273:P:ipc_fc_shm:test_ipc_fc_shm:0: Passed
check_ipc.c:273:P:ipc_fc_us:test_ipc_fc_us:0: Passed
check_ipc.c:273:P:ipc_txrx_posix_mq:test_ipc_txrx_pmq:0: Passed
check_ipc.c:273:P:ipc_txrx_sysv_mq:test_ipc_txrx_smq:0: Passed
check_ipc.c:391:P:ipc_dispatch_shm:test_ipc_disp_shm:0: Passed
check_ipc.c:403:E:ipc_dispatch_us:test_ipc_disp_us:0: (after this point) Test timeout expired


FAIL: resources.test (exit: 1)
==============================

/dev/shm/qb-test_ipc_disp_us-control-13639-8
/dev/shm/qb-test_ipc_disp_us-control-19058-8
/dev/shm/qb-test_ipc_disp_us-control-3040-8
/dev/shm/qb-test_ipc_disp_us-control-8355-8

Error: shared memory segments not closed/unlinked

Thanks,
Seth



More information about the pve-devel mailing list