Error building pve-qemu-kvm from source

Musee Ullah lae at lae.is
Sun Aug 29 22:38:26 CEST 2021


Hi,

Been a while. How are all the PVE Ansible role users doing?

I'm attempting to build pve-qemu-kvm with pulseaudio support, but I'm 
running into the following error and I'm not sure if there's a step 
missing or if there's an issue with the build process (as far as I can 
tell, it seems unlikely because I also can't compile a checked out 
6.0.0-3 that's already out in the pve repos).

[220/2951] Compiling C object vma.p/vma.c.o
FAILED: vma.p/vma.c.o
cc -Ivma.p -I. -I.. -I/usr/include/glib-2.0 -I/usr/lib/x86_64-linux-gnu/glib-2.0/include -fdiagnostics-color=auto -pipe -Wall -Winvalid-pch -std=gnu99 -O2 -g -isystem /home/lae/build/pve-qemu/pve-qemu-kvm-6.0.0/linux-headers -isystem linux-headers -iquote . -iquote /home/lae/build/pve-qemu/pve-qemu-kvm-6.0.0 -iquote /home/lae/build/pve-qemu/pve-qemu-kvm-6.0.0/include -iquote /home/lae/build/pve-qemu/pve-qemu-kvm-6.0.0/disas/libvixl -iquote /home/lae/build/pve-qemu/pve-qemu-kvm-6.0.0/tcg/i386 -iquote /home/lae/build/pve-qemu/pve-qemu-kvm-6.0.0/accel/tcg -pthread -U_FORTIFY_SOURCE -D_FORTIFY_SOURCE=2 -m64 -mcx16 -D_GNU_SOURCE -D_FILE_OFFSET_BITS=64 -D_LARGEFILE_SOURCE -Wstrict-prototypes -Wredundant-decls -Wundef -Wwrite-strings -Wmissing-prototypes -fno-strict-aliasing -fno-common -fwrapv -Wold-style-declaration -Wold-style-definition -Wtype-limits -Wformat-security -Wformat-y2k -Winit-self -Wignored-qualifiers -Wempty-body -Wnested-externs -Wendif-labels -Wexpansion-to-defined -Wimplicit-fallthrough=2 -Wno-missing-include-dirs -Wno-shift-negative-value -Wno-psabi -fstack-protector-strong -fPIE -MD -MQ vma.p/vma.c.o -MF vma.p/vma.c.o.d -o vma.p/vma.c.o -c ../vma.c
In file included from ../vma.h:18,
                  from ../vma.c:17:
/home/lae/build/pve-qemu/pve-qemu-kvm-6.0.0/include/qapi/error.h:275:10: fatal error: qapi/qapi-types-error.h: No such file or directory
   275 | #include "qapi/qapi-types-error.h"
       |          ^~~~~~~~~~~~~~~~~~~~~~~~~
compilation terminated.

(full log attached)

The steps I'm taking to build the package are as follows (as 
unprivileged user):

git clone git://git.proxmox.com/git/pve-qemu.git
cd pve-qemu
sed -i '/audio-drv-list/ s/alsa/alsa,pa/' debian/rules
sudo mk-build-deps -ir
make dinstall

(on another note I also attempted another build using --recursive in the 
git checkout, but the problem is still reproduced)

I've attempted to compiled qemu 6.0.0 from upstream and it seems to 
generate and use `qapi-types.error.h` without issue, so I don't think 
this is a dependency issue. I believe scripts/qapi-gen.py is supposed to 
generate these files?

Thanks in advance for your help.


P.S. I also note that there's a thread from 2019 [0] with someone asking 
for pulseaudio driver support but it seems like nothing ever came of it. 
I understand that ideally PVE would want to support it via the qm 
utility but would it be possible to just compile the driver upstream 
before that (so users can pass custom -audiodev arguments for qemu 
theirselves)?

[0] https://forum.proxmox.com/threads/audiodev-driver-pa-support.62317/

-------------- next part --------------
lae at lilienne:~/build$ git clone git://git.proxmox.com/git/pve-qemu.git
Cloning into 'pve-qemu'...
remote: Enumerating objects: 2657, done.
remote: Counting objects: 100% (2657/2657), done.
remote: Compressing objects: 100% (770/770), done.
remote: Total 2657 (delta 1874), reused 2657 (delta 1874)s
Receiving objects: 100% (2657/2657), 3.25 MiB | 1.58 MiB/s, done.
Resolving deltas: 100% (1874/1874), done.
lae at lilienne:~/build$ cd pve-qemu
lae at lilienne:~/build/pve-qemu$ sed -i '/audio-drv-list/ s/alsa/alsa,pa/' debian/rules
lae at lilienne:~/build/pve-qemu$ sudo mk-build-deps -ir
dpkg-buildpackage: info: source package pve-qemu-kvm-build-deps
dpkg-buildpackage: info: source version 6.0.0-3
dpkg-buildpackage: info: source distribution unstable
dpkg-buildpackage: info: source changed by Equivs Dummy Package Generator <root at x>
dpkg-buildpackage: info: host architecture amd64
 dpkg-source --before-build .
 debian/rules clean
dh clean
   dh_clean
 debian/rules binary
dh binary
   dh_update_autotools_config
   dh_autoreconf
   create-stamp debian/debhelper-build-stamp
   dh_prep
   dh_install
   dh_installdocs
   dh_installchangelogs
   dh_perl
   dh_link
   dh_strip_nondeterminism
   dh_compress
   dh_fixperms
   dh_missing
   dh_installdeb
   dh_gencontrol
   dh_md5sums
   dh_builddeb
dpkg-deb: building package 'pve-qemu-kvm-build-deps' in '../pve-qemu-kvm-build-deps_6.0.0-3_all.deb'.
 dpkg-genbuildinfo --build=binary
 dpkg-genchanges --build=binary >../pve-qemu-kvm-build-deps_6.0.0-3_amd64.changes
dpkg-genchanges: info: binary-only upload (no source code included)
 dpkg-source --after-build .
dpkg-buildpackage: info: binary-only upload (no source included)

The package has been created.
Attention, the package has been created in the current directory,
not in ".." as indicated by the message above!
Selecting previously unselected package pve-qemu-kvm-build-deps.
(Reading database ... 134806 files and directories currently installed.)
Preparing to unpack pve-qemu-kvm-build-deps_6.0.0-3_all.deb ...
Unpacking pve-qemu-kvm-build-deps (6.0.0-3) ...
Reading package lists... Done
Building dependency tree... Done
Reading state information... Done
Correcting dependencies...Starting pkgProblemResolver with broken count: 0
Starting 2 pkgProblemResolver with broken count: 0
Done
 Done
Starting pkgProblemResolver with broken count: 0
Starting 2 pkgProblemResolver with broken count: 0
Done
The following additional packages will be installed:
  check docutils-common libaio-dev libblkid-dev libcaca-dev libcap-ng-dev libfdt-dev libffi-dev libglib2.0-bin libglib2.0-dev libglib2.0-dev-bin libglu1-mesa libglu1-mesa-dev libiscsi-dev libjemalloc-dev libjs-sphinxdoc
  libjs-underscore libmount-dev libnuma-dev libpci-dev libpcre16-3 libpcre2-16-0 libpcre2-32-0 libpcre2-dev libpcre2-posix2 libpcre3-dev libpcre32-3 libpcrecpp0v5 libpixman-1-dev libproxmox-backup-qemu0-dev libpulse-dev
  libpulse-mainloop-glib0 librados-dev librbd-dev libsdl1.2-dev libseccomp-dev libselinux1-dev libsepol1-dev libslang2-dev libspice-protocol-dev libspice-server-dev libsubunit-dev libsubunit0 libsystemd-dev libtext-unidecode-perl
  liburing-dev libusb-1.0-0-dev libusbredirparser-dev libxext-dev meson python-babel-localedata python3-alabaster python3-babel python3-docutils python3-imagesize python3-pygments python3-roman python3-snowballstemmer
  python3-sphinx python3-tz quilt sgml-base sphinx-common tex-common texi2html texinfo uuid-dev x11proto-xext-dev xfslibs-dev xml-core
Suggested packages:
  libgirepository1.0-dev libglib2.0-doc libxml2-utils seccomp libxext-doc docutils-doc fonts-linuxlibertine | ttf-linux-libertine texlive-lang-french texlive-latex-base texlive-latex-recommended python-pygments-doc
  ttf-bitstream-vera python3-stemmer dvipng fonts-freefont-otf imagemagick-6.q16 latexmk libjs-mathjax python3-sphinx-rtd-theme sphinx-doc texlive-fonts-recommended texlive-latex-extra texlive-plain-generic graphviz procmail
  sgml-base-doc latex2html texlive-base
Recommended packages:
  libusb-1.0-doc libpaper-utils python3-pil
The following NEW packages will be installed:
  check docutils-common libaio-dev libblkid-dev libcaca-dev libcap-ng-dev libfdt-dev libffi-dev libglib2.0-bin libglib2.0-dev libglib2.0-dev-bin libglu1-mesa libglu1-mesa-dev libiscsi-dev libjemalloc-dev libjs-sphinxdoc
  libjs-underscore libmount-dev libnuma-dev libpci-dev libpcre16-3 libpcre2-16-0 libpcre2-32-0 libpcre2-dev libpcre2-posix2 libpcre3-dev libpcre32-3 libpcrecpp0v5 libpixman-1-dev libproxmox-backup-qemu0-dev libpulse-dev
  libpulse-mainloop-glib0 librados-dev librbd-dev libsdl1.2-dev libseccomp-dev libselinux1-dev libsepol1-dev libslang2-dev libspice-protocol-dev libspice-server-dev libsubunit-dev libsubunit0 libsystemd-dev libtext-unidecode-perl
  liburing-dev libusb-1.0-0-dev libusbredirparser-dev libxext-dev meson python-babel-localedata python3-alabaster python3-babel python3-docutils python3-imagesize python3-pygments python3-roman python3-snowballstemmer
  python3-sphinx python3-tz quilt sgml-base sphinx-common tex-common texi2html texinfo uuid-dev x11proto-xext-dev xfslibs-dev xml-core
0 upgraded, 70 newly installed, 0 to remove and 0 not upgraded.
1 not fully installed or removed.
Need to get 15.0 MB/21.3 MB of archives.
After this operation, 103 MB of additional disk space will be used.
Do you want to continue? [Y/n]
Get:1 http://dallas.mirrors.linode.com/debian bullseye/main amd64 libsubunit0 amd64 1.4.0-3 [9,724 B]
Get:2 http://dallas.mirrors.linode.com/debian bullseye/main amd64 libsubunit-dev amd64 1.4.0-3 [10.7 kB]
Get:3 http://dallas.mirrors.linode.com/debian bullseye/main amd64 check amd64 0.15.2-2 [115 kB]
Get:4 http://dallas.mirrors.linode.com/debian bullseye/main amd64 libjemalloc-dev amd64 5.2.1-3 [437 kB]
Get:5 http://dallas.mirrors.linode.com/debian bullseye/main amd64 libpci-dev amd64 1:3.7.0-5 [60.6 kB]
Get:6 http://dallas.mirrors.linode.com/debian bullseye/main amd64 librados-dev amd64 14.2.21-1 [106 kB]
Get:7 http://dallas.mirrors.linode.com/debian bullseye/main amd64 libslang2-dev amd64 2.3.2-5 [485 kB]
Get:8 http://dallas.mirrors.linode.com/debian bullseye/main amd64 libcaca-dev amd64 0.99.beta19-2.2 [893 kB]
Get:9 http://dallas.mirrors.linode.com/debian bullseye/main amd64 libglu1-mesa amd64 9.0.1-1 [168 kB]
Get:10 http://dallas.mirrors.linode.com/debian bullseye/main amd64 libglu1-mesa-dev amd64 9.0.1-1 [207 kB]
Get:11 http://dallas.mirrors.linode.com/debian bullseye/main amd64 libpulse-mainloop-glib0 amd64 14.2-2 [42.1 kB]
Get:12 http://dallas.mirrors.linode.com/debian bullseye/main amd64 libffi-dev amd64 3.3-6 [56.5 kB]
Get:13 http://dallas.mirrors.linode.com/debian bullseye/main amd64 libglib2.0-bin amd64 2.66.8-1 [141 kB]
Get:14 http://dallas.mirrors.linode.com/debian bullseye/main amd64 libglib2.0-dev-bin amd64 2.66.8-1 [179 kB]
Get:15 http://dallas.mirrors.linode.com/debian bullseye/main amd64 libsepol1-dev amd64 3.1-1 [338 kB]
Get:16 http://dallas.mirrors.linode.com/debian bullseye/main amd64 libpcre2-16-0 amd64 10.36-2 [231 kB]
Get:17 http://dallas.mirrors.linode.com/debian bullseye/main amd64 libpcre2-32-0 amd64 10.36-2 [220 kB]
Get:18 http://dallas.mirrors.linode.com/debian bullseye/main amd64 libpcre2-posix2 amd64 10.36-2 [49.1 kB]
Get:19 http://dallas.mirrors.linode.com/debian bullseye/main amd64 libpcre2-dev amd64 10.36-2 [731 kB]
Get:20 http://dallas.mirrors.linode.com/debian bullseye/main amd64 libselinux1-dev amd64 3.1-3 [168 kB]
Get:21 http://dallas.mirrors.linode.com/debian bullseye/main amd64 libpcre16-3 amd64 2:8.39-13 [259 kB]
Get:22 http://dallas.mirrors.linode.com/debian bullseye/main amd64 libpcre32-3 amd64 2:8.39-13 [250 kB]
Get:23 http://dallas.mirrors.linode.com/debian bullseye/main amd64 libpcrecpp0v5 amd64 2:8.39-13 [152 kB]
Get:24 http://dallas.mirrors.linode.com/debian bullseye/main amd64 libpcre3-dev amd64 2:8.39-13 [650 kB]
Get:25 http://dallas.mirrors.linode.com/debian bullseye/main amd64 x11proto-xext-dev all 2020.1-1 [3,404 B]
Get:26 http://dallas.mirrors.linode.com/debian bullseye/main amd64 libxext-dev amd64 2:1.3.3-1.1 [107 kB]
Get:27 http://dallas.mirrors.linode.com/debian bullseye/main amd64 libsdl1.2-dev amd64 1.2.15+dfsg2-6 [730 kB]
Get:28 http://dallas.mirrors.linode.com/debian bullseye/main amd64 libsystemd-dev amd64 247.3-6 [401 kB]
Get:29 http://dallas.mirrors.linode.com/debian bullseye/main amd64 sphinx-common all 3.4.3-2 [578 kB]
Get:30 http://dallas.mirrors.linode.com/debian bullseye/main amd64 python3-alabaster all 0.7.8-1.1 [18.6 kB]
Get:31 http://dallas.mirrors.linode.com/debian bullseye/main amd64 python-babel-localedata all 2.8.0+dfsg.1-7 [4,997 kB]
Get:32 http://download.proxmox.com/debian/pve bullseye/pve-no-subscription amd64 libproxmox-backup-qemu0-dev amd64 1.2.0-1 [6,284 B]
Get:33 http://dallas.mirrors.linode.com/debian bullseye/main amd64 python3-tz all 2021.1-1 [34.8 kB]
Get:34 http://dallas.mirrors.linode.com/debian bullseye/main amd64 python3-babel all 2.8.0+dfsg.1-7 [100 kB]
Get:35 http://dallas.mirrors.linode.com/debian bullseye/main amd64 sgml-base all 1.30 [15.1 kB]
Get:36 http://dallas.mirrors.linode.com/debian bullseye/main amd64 xml-core all 0.18+nmu1 [23.8 kB]
Get:37 http://dallas.mirrors.linode.com/debian bullseye/main amd64 docutils-common all 0.16+dfsg-4 [129 kB]
Get:38 http://dallas.mirrors.linode.com/debian bullseye/main amd64 python3-roman all 2.0.0-5 [9,064 B]
Get:39 http://dallas.mirrors.linode.com/debian bullseye/main amd64 python3-docutils all 0.16+dfsg-4 [384 kB]
Get:40 http://dallas.mirrors.linode.com/debian bullseye/main amd64 python3-imagesize all 1.2.0-2 [5,824 B]
Get:41 http://dallas.mirrors.linode.com/debian bullseye/main amd64 python3-pygments all 2.7.1+dfsg-2.1 [657 kB]
Get:42 http://dallas.mirrors.linode.com/debian bullseye/main amd64 python3-snowballstemmer all 2.1.0-1 [58.7 kB]
Get:43 http://dallas.mirrors.linode.com/debian bullseye/main amd64 quilt all 0.66-2.1 [319 kB]
Get:44 http://dallas.mirrors.linode.com/debian bullseye/main amd64 libtext-unidecode-perl all 1.30-1 [103 kB]
Get:45 http://dallas.mirrors.linode.com/debian bullseye/main amd64 texi2html all 1.82+dfsg1-6 [356 kB]
Get:46 http://dallas.mirrors.linode.com/debian bullseye/main amd64 tex-common all 6.16 [53.7 kB]
Fetched 15.0 MB in 1s (18.4 MB/s)
Extracting templates from packages: 100%
Selecting previously unselected package libsubunit0:amd64.
(Reading database ... 134810 files and directories currently installed.)
Preparing to unpack .../00-libsubunit0_1.4.0-3_amd64.deb ...
Unpacking libsubunit0:amd64 (1.4.0-3) ...
Selecting previously unselected package libsubunit-dev:amd64.
Preparing to unpack .../01-libsubunit-dev_1.4.0-3_amd64.deb ...
Unpacking libsubunit-dev:amd64 (1.4.0-3) ...
Selecting previously unselected package check:amd64.
Preparing to unpack .../02-check_0.15.2-2_amd64.deb ...
Unpacking check:amd64 (0.15.2-2) ...
Selecting previously unselected package libaio-dev:amd64.
Preparing to unpack .../03-libaio-dev_0.3.112-9_amd64.deb ...
Unpacking libaio-dev:amd64 (0.3.112-9) ...
Selecting previously unselected package libcap-ng-dev.
Preparing to unpack .../04-libcap-ng-dev_0.7.9-2.2+b1_amd64.deb ...
Unpacking libcap-ng-dev (0.7.9-2.2+b1) ...
Selecting previously unselected package libfdt-dev.
Preparing to unpack .../05-libfdt-dev_1.6.0-1_amd64.deb ...
Unpacking libfdt-dev (1.6.0-1) ...
Selecting previously unselected package libiscsi-dev:amd64.
Preparing to unpack .../06-libiscsi-dev_1.19.0-3_amd64.deb ...
Unpacking libiscsi-dev:amd64 (1.19.0-3) ...
Selecting previously unselected package libjemalloc-dev.
Preparing to unpack .../07-libjemalloc-dev_5.2.1-3_amd64.deb ...
Unpacking libjemalloc-dev (5.2.1-3) ...
Selecting previously unselected package libnuma-dev:amd64.
Preparing to unpack .../08-libnuma-dev_2.0.12-1+b1_amd64.deb ...
Unpacking libnuma-dev:amd64 (2.0.12-1+b1) ...
Selecting previously unselected package libpci-dev:amd64.
Preparing to unpack .../09-libpci-dev_1%3a3.7.0-5_amd64.deb ...
Unpacking libpci-dev:amd64 (1:3.7.0-5) ...
Selecting previously unselected package libpixman-1-dev:amd64.
Preparing to unpack .../10-libpixman-1-dev_0.40.0-1_amd64.deb ...
Unpacking libpixman-1-dev:amd64 (0.40.0-1) ...
Selecting previously unselected package libproxmox-backup-qemu0-dev.
Preparing to unpack .../11-libproxmox-backup-qemu0-dev_1.2.0-1_amd64.deb ...
Unpacking libproxmox-backup-qemu0-dev (1.2.0-1) ...
Selecting previously unselected package librados-dev.
Preparing to unpack .../12-librados-dev_14.2.21-1_amd64.deb ...
Unpacking librados-dev (14.2.21-1) ...
Selecting previously unselected package librbd-dev.
Preparing to unpack .../13-librbd-dev_14.2.21-1_amd64.deb ...
Unpacking librbd-dev (14.2.21-1) ...
Selecting previously unselected package libslang2-dev:amd64.
Preparing to unpack .../14-libslang2-dev_2.3.2-5_amd64.deb ...
Unpacking libslang2-dev:amd64 (2.3.2-5) ...
Selecting previously unselected package libcaca-dev.
Preparing to unpack .../15-libcaca-dev_0.99.beta19-2.2_amd64.deb ...
Unpacking libcaca-dev (0.99.beta19-2.2) ...
Selecting previously unselected package libglu1-mesa:amd64.
Preparing to unpack .../16-libglu1-mesa_9.0.1-1_amd64.deb ...
Unpacking libglu1-mesa:amd64 (9.0.1-1) ...
Selecting previously unselected package libglu1-mesa-dev:amd64.
Preparing to unpack .../17-libglu1-mesa-dev_9.0.1-1_amd64.deb ...
Unpacking libglu1-mesa-dev:amd64 (9.0.1-1) ...
Selecting previously unselected package libpulse-mainloop-glib0:amd64.
Preparing to unpack .../18-libpulse-mainloop-glib0_14.2-2_amd64.deb ...
Unpacking libpulse-mainloop-glib0:amd64 (14.2-2) ...
Selecting previously unselected package libffi-dev:amd64.
Preparing to unpack .../19-libffi-dev_3.3-6_amd64.deb ...
Unpacking libffi-dev:amd64 (3.3-6) ...
Selecting previously unselected package libglib2.0-bin.
Preparing to unpack .../20-libglib2.0-bin_2.66.8-1_amd64.deb ...
Unpacking libglib2.0-bin (2.66.8-1) ...
Selecting previously unselected package libglib2.0-dev-bin.
Preparing to unpack .../21-libglib2.0-dev-bin_2.66.8-1_amd64.deb ...
Unpacking libglib2.0-dev-bin (2.66.8-1) ...
Selecting previously unselected package uuid-dev:amd64.
Preparing to unpack .../22-uuid-dev_2.36.1-8_amd64.deb ...
Unpacking uuid-dev:amd64 (2.36.1-8) ...
Selecting previously unselected package libblkid-dev:amd64.
Preparing to unpack .../23-libblkid-dev_2.36.1-8_amd64.deb ...
Unpacking libblkid-dev:amd64 (2.36.1-8) ...
Selecting previously unselected package libsepol1-dev:amd64.
Preparing to unpack .../24-libsepol1-dev_3.1-1_amd64.deb ...
Unpacking libsepol1-dev:amd64 (3.1-1) ...
Selecting previously unselected package libpcre2-16-0:amd64.
Preparing to unpack .../25-libpcre2-16-0_10.36-2_amd64.deb ...
Unpacking libpcre2-16-0:amd64 (10.36-2) ...
Selecting previously unselected package libpcre2-32-0:amd64.
Preparing to unpack .../26-libpcre2-32-0_10.36-2_amd64.deb ...
Unpacking libpcre2-32-0:amd64 (10.36-2) ...
Selecting previously unselected package libpcre2-posix2:amd64.
Preparing to unpack .../27-libpcre2-posix2_10.36-2_amd64.deb ...
Unpacking libpcre2-posix2:amd64 (10.36-2) ...
Selecting previously unselected package libpcre2-dev:amd64.
Preparing to unpack .../28-libpcre2-dev_10.36-2_amd64.deb ...
Unpacking libpcre2-dev:amd64 (10.36-2) ...
Selecting previously unselected package libselinux1-dev:amd64.
Preparing to unpack .../29-libselinux1-dev_3.1-3_amd64.deb ...
Unpacking libselinux1-dev:amd64 (3.1-3) ...
Selecting previously unselected package libmount-dev:amd64.
Preparing to unpack .../30-libmount-dev_2.36.1-8_amd64.deb ...
Unpacking libmount-dev:amd64 (2.36.1-8) ...
Selecting previously unselected package libpcre16-3:amd64.
Preparing to unpack .../31-libpcre16-3_2%3a8.39-13_amd64.deb ...
Unpacking libpcre16-3:amd64 (2:8.39-13) ...
Selecting previously unselected package libpcre32-3:amd64.
Preparing to unpack .../32-libpcre32-3_2%3a8.39-13_amd64.deb ...
Unpacking libpcre32-3:amd64 (2:8.39-13) ...
Selecting previously unselected package libpcrecpp0v5:amd64.
Preparing to unpack .../33-libpcrecpp0v5_2%3a8.39-13_amd64.deb ...
Unpacking libpcrecpp0v5:amd64 (2:8.39-13) ...
Selecting previously unselected package libpcre3-dev:amd64.
Preparing to unpack .../34-libpcre3-dev_2%3a8.39-13_amd64.deb ...
Unpacking libpcre3-dev:amd64 (2:8.39-13) ...
Selecting previously unselected package libglib2.0-dev:amd64.
Preparing to unpack .../35-libglib2.0-dev_2.66.8-1_amd64.deb ...
Unpacking libglib2.0-dev:amd64 (2.66.8-1) ...
Selecting previously unselected package libpulse-dev:amd64.
Preparing to unpack .../36-libpulse-dev_14.2-2_amd64.deb ...
Unpacking libpulse-dev:amd64 (14.2-2) ...
Selecting previously unselected package x11proto-xext-dev.
Preparing to unpack .../37-x11proto-xext-dev_2020.1-1_all.deb ...
Unpacking x11proto-xext-dev (2020.1-1) ...
Selecting previously unselected package libxext-dev:amd64.
Preparing to unpack .../38-libxext-dev_2%3a1.3.3-1.1_amd64.deb ...
Unpacking libxext-dev:amd64 (2:1.3.3-1.1) ...
Selecting previously unselected package libsdl1.2-dev.
Preparing to unpack .../39-libsdl1.2-dev_1.2.15+dfsg2-6_amd64.deb ...
Unpacking libsdl1.2-dev (1.2.15+dfsg2-6) ...
Selecting previously unselected package libseccomp-dev:amd64.
Preparing to unpack .../40-libseccomp-dev_2.5.1-1_amd64.deb ...
Unpacking libseccomp-dev:amd64 (2.5.1-1) ...
Selecting previously unselected package libspice-protocol-dev.
Preparing to unpack .../41-libspice-protocol-dev_0.14.3-1_all.deb ...
Unpacking libspice-protocol-dev (0.14.3-1) ...
Selecting previously unselected package libspice-server-dev:amd64.
Preparing to unpack .../42-libspice-server-dev_0.14.3-2.1_amd64.deb ...
Unpacking libspice-server-dev:amd64 (0.14.3-2.1) ...
Selecting previously unselected package libsystemd-dev:amd64.
Preparing to unpack .../43-libsystemd-dev_247.3-6_amd64.deb ...
Unpacking libsystemd-dev:amd64 (247.3-6) ...
Selecting previously unselected package liburing-dev:amd64.
Preparing to unpack .../44-liburing-dev_0.7-3_amd64.deb ...
Unpacking liburing-dev:amd64 (0.7-3) ...
Selecting previously unselected package libusb-1.0-0-dev:amd64.
Preparing to unpack .../45-libusb-1.0-0-dev_2%3a1.0.24-3_amd64.deb ...
Unpacking libusb-1.0-0-dev:amd64 (2:1.0.24-3) ...
Selecting previously unselected package libusbredirparser-dev:amd64.
Preparing to unpack .../46-libusbredirparser-dev_0.8.0-1+b1_amd64.deb ...
Unpacking libusbredirparser-dev:amd64 (0.8.0-1+b1) ...
Selecting previously unselected package meson.
Preparing to unpack .../47-meson_0.56.2-1_all.deb ...
Unpacking meson (0.56.2-1) ...
Selecting previously unselected package libjs-underscore.
Preparing to unpack .../48-libjs-underscore_1.9.1~dfsg-3_all.deb ...
Unpacking libjs-underscore (1.9.1~dfsg-3) ...
Selecting previously unselected package libjs-sphinxdoc.
Preparing to unpack .../49-libjs-sphinxdoc_3.4.3-2_all.deb ...
Unpacking libjs-sphinxdoc (3.4.3-2) ...
Selecting previously unselected package sphinx-common.
Preparing to unpack .../50-sphinx-common_3.4.3-2_all.deb ...
Unpacking sphinx-common (3.4.3-2) ...
Selecting previously unselected package python3-alabaster.
Preparing to unpack .../51-python3-alabaster_0.7.8-1.1_all.deb ...
Unpacking python3-alabaster (0.7.8-1.1) ...
Selecting previously unselected package python-babel-localedata.
Preparing to unpack .../52-python-babel-localedata_2.8.0+dfsg.1-7_all.deb ...
Unpacking python-babel-localedata (2.8.0+dfsg.1-7) ...
Selecting previously unselected package python3-tz.
Preparing to unpack .../53-python3-tz_2021.1-1_all.deb ...
Unpacking python3-tz (2021.1-1) ...
Selecting previously unselected package python3-babel.
Preparing to unpack .../54-python3-babel_2.8.0+dfsg.1-7_all.deb ...
Unpacking python3-babel (2.8.0+dfsg.1-7) ...
Selecting previously unselected package sgml-base.
Preparing to unpack .../55-sgml-base_1.30_all.deb ...
Unpacking sgml-base (1.30) ...
Selecting previously unselected package xml-core.
Preparing to unpack .../56-xml-core_0.18+nmu1_all.deb ...
Unpacking xml-core (0.18+nmu1) ...
Selecting previously unselected package docutils-common.
Preparing to unpack .../57-docutils-common_0.16+dfsg-4_all.deb ...
Unpacking docutils-common (0.16+dfsg-4) ...
Selecting previously unselected package python3-roman.
Preparing to unpack .../58-python3-roman_2.0.0-5_all.deb ...
Unpacking python3-roman (2.0.0-5) ...
Selecting previously unselected package python3-docutils.
Preparing to unpack .../59-python3-docutils_0.16+dfsg-4_all.deb ...
Unpacking python3-docutils (0.16+dfsg-4) ...
Selecting previously unselected package python3-imagesize.
Preparing to unpack .../60-python3-imagesize_1.2.0-2_all.deb ...
Unpacking python3-imagesize (1.2.0-2) ...
Selecting previously unselected package python3-pygments.
Preparing to unpack .../61-python3-pygments_2.7.1+dfsg-2.1_all.deb ...
Unpacking python3-pygments (2.7.1+dfsg-2.1) ...
Selecting previously unselected package python3-snowballstemmer.
Preparing to unpack .../62-python3-snowballstemmer_2.1.0-1_all.deb ...
Unpacking python3-snowballstemmer (2.1.0-1) ...
Selecting previously unselected package python3-sphinx.
Preparing to unpack .../63-python3-sphinx_3.4.3-2_all.deb ...
Unpacking python3-sphinx (3.4.3-2) ...
Selecting previously unselected package quilt.
Preparing to unpack .../64-quilt_0.66-2.1_all.deb ...
Unpacking quilt (0.66-2.1) ...
Selecting previously unselected package libtext-unidecode-perl.
Preparing to unpack .../65-libtext-unidecode-perl_1.30-1_all.deb ...
Unpacking libtext-unidecode-perl (1.30-1) ...
Selecting previously unselected package texi2html.
Preparing to unpack .../66-texi2html_1.82+dfsg1-6_all.deb ...
Unpacking texi2html (1.82+dfsg1-6) ...
Selecting previously unselected package tex-common.
Preparing to unpack .../67-tex-common_6.16_all.deb ...
Unpacking tex-common (6.16) ...
Selecting previously unselected package texinfo.
Preparing to unpack .../68-texinfo_6.7.0.dfsg.2-6_amd64.deb ...
Unpacking texinfo (6.7.0.dfsg.2-6) ...
Selecting previously unselected package xfslibs-dev.
Preparing to unpack .../69-xfslibs-dev_5.10.0-4_amd64.deb ...
Unpacking xfslibs-dev (5.10.0-4) ...
Setting up librados-dev (14.2.21-1) ...
Setting up libpcrecpp0v5:amd64 (2:8.39-13) ...
Setting up libslang2-dev:amd64 (2.3.2-5) ...
Setting up libglib2.0-dev-bin (2.66.8-1) ...
Setting up libseccomp-dev:amd64 (2.5.1-1) ...
Setting up libpixman-1-dev:amd64 (0.40.0-1) ...
Setting up libpcre16-3:amd64 (2:8.39-13) ...
Setting up python3-alabaster (0.7.8-1.1) ...
Setting up libusbredirparser-dev:amd64 (0.8.0-1+b1) ...
Setting up libiscsi-dev:amd64 (1.19.0-3) ...
Setting up libsepol1-dev:amd64 (3.1-1) ...
Setting up libglib2.0-bin (2.66.8-1) ...
Setting up libusb-1.0-0-dev:amd64 (2:1.0.24-3) ...
Setting up meson (0.56.2-1) ...
Setting up quilt (0.66-2.1) ...
Setting up libspice-protocol-dev (0.14.3-1) ...
Setting up libaio-dev:amd64 (0.3.112-9) ...
Setting up libffi-dev:amd64 (3.3-6) ...
Setting up libsubunit0:amd64 (1.4.0-3) ...
Setting up libpcre2-16-0:amd64 (10.36-2) ...
Setting up libproxmox-backup-qemu0-dev (1.2.0-1) ...
Setting up python3-tz (2021.1-1) ...
Setting up python-babel-localedata (2.8.0+dfsg.1-7) ...
Setting up libnuma-dev:amd64 (2.0.12-1+b1) ...
Setting up libfdt-dev (1.6.0-1) ...
Setting up tex-common (6.16) ...
update-language: texlive-base not installed and configured, doing nothing!
Setting up libjemalloc-dev (5.2.1-3) ...
Setting up python3-roman (2.0.0-5) ...
Setting up python3-pygments (2.7.1+dfsg-2.1) ...
Setting up libpcre2-32-0:amd64 (10.36-2) ...
Setting up python3-snowballstemmer (2.1.0-1) ...
Setting up uuid-dev:amd64 (2.36.1-8) ...
Setting up libpulse-mainloop-glib0:amd64 (14.2-2) ...
Setting up libpcre32-3:amd64 (2:8.39-13) ...
Setting up libpcre2-posix2:amd64 (10.36-2) ...
Setting up x11proto-xext-dev (2020.1-1) ...
Setting up libcap-ng-dev (0.7.9-2.2+b1) ...
Setting up sgml-base (1.30) ...
Setting up libglu1-mesa:amd64 (9.0.1-1) ...
Setting up libtext-unidecode-perl (1.30-1) ...
Setting up libcaca-dev (0.99.beta19-2.2) ...
Setting up xfslibs-dev (5.10.0-4) ...
Setting up libsystemd-dev:amd64 (247.3-6) ...
Setting up liburing-dev:amd64 (0.7-3) ...
Setting up libpci-dev:amd64 (1:3.7.0-5) ...
Setting up librbd-dev (14.2.21-1) ...
Setting up libjs-underscore (1.9.1~dfsg-3) ...
Setting up python3-imagesize (1.2.0-2) ...
Setting up libspice-server-dev:amd64 (0.14.3-2.1) ...
Setting up libblkid-dev:amd64 (2.36.1-8) ...
Setting up libpcre2-dev:amd64 (10.36-2) ...
Setting up python3-babel (2.8.0+dfsg.1-7) ...
update-alternatives: using /usr/bin/pybabel-python3 to provide /usr/bin/pybabel (pybabel) in auto mode
Setting up libselinux1-dev:amd64 (3.1-3) ...
Setting up libpcre3-dev:amd64 (2:8.39-13) ...
Setting up libsubunit-dev:amd64 (1.4.0-3) ...
Setting up texi2html (1.82+dfsg1-6) ...
Setting up libglu1-mesa-dev:amd64 (9.0.1-1) ...
Setting up check:amd64 (0.15.2-2) ...
Setting up texinfo (6.7.0.dfsg.2-6) ...
Setting up libjs-sphinxdoc (3.4.3-2) ...
Setting up libxext-dev:amd64 (2:1.3.3-1.1) ...
Setting up xml-core (0.18+nmu1) ...
Setting up libmount-dev:amd64 (2.36.1-8) ...
Setting up libglib2.0-dev:amd64 (2.66.8-1) ...
Setting up sphinx-common (3.4.3-2) ...
Processing triggers for shared-mime-info (2.0-1) ...
Processing triggers for libglib2.0-0:amd64 (2.66.8-1) ...
Processing triggers for libc-bin (2.31-13) ...
Processing triggers for man-db (2.9.4-2) ...
Setting up libpulse-dev:amd64 (14.2-2) ...
Setting up libsdl1.2-dev (1.2.15+dfsg2-6) ...
Processing triggers for sgml-base (1.30) ...
Setting up docutils-common (0.16+dfsg-4) ...
Processing triggers for sgml-base (1.30) ...
Setting up python3-docutils (0.16+dfsg-4) ...
update-alternatives: using /usr/share/docutils/scripts/python3/rst-buildhtml to provide /usr/bin/rst-buildhtml (rst-buildhtml) in auto mode
update-alternatives: using /usr/share/docutils/scripts/python3/rst2html to provide /usr/bin/rst2html (rst2html) in auto mode
update-alternatives: using /usr/share/docutils/scripts/python3/rst2html4 to provide /usr/bin/rst2html4 (rst2html4) in auto mode
update-alternatives: using /usr/share/docutils/scripts/python3/rst2html5 to provide /usr/bin/rst2html5 (rst2html5) in auto mode
update-alternatives: using /usr/share/docutils/scripts/python3/rst2latex to provide /usr/bin/rst2latex (rst2latex) in auto mode
update-alternatives: using /usr/share/docutils/scripts/python3/rst2man to provide /usr/bin/rst2man (rst2man) in auto mode
update-alternatives: using /usr/share/docutils/scripts/python3/rst2odt to provide /usr/bin/rst2odt (rst2odt) in auto mode
update-alternatives: using /usr/share/docutils/scripts/python3/rst2odt_prepstyles to provide /usr/bin/rst2odt_prepstyles (rst2odt_prepstyles) in auto mode
update-alternatives: using /usr/share/docutils/scripts/python3/rst2pseudoxml to provide /usr/bin/rst2pseudoxml (rst2pseudoxml) in auto mode
update-alternatives: using /usr/share/docutils/scripts/python3/rst2s5 to provide /usr/bin/rst2s5 (rst2s5) in auto mode
update-alternatives: using /usr/share/docutils/scripts/python3/rst2xetex to provide /usr/bin/rst2xetex (rst2xetex) in auto mode
update-alternatives: using /usr/share/docutils/scripts/python3/rst2xml to provide /usr/bin/rst2xml (rst2xml) in auto mode
update-alternatives: using /usr/share/docutils/scripts/python3/rstpep2html to provide /usr/bin/rstpep2html (rstpep2html) in auto mode
Setting up python3-sphinx (3.4.3-2) ...
Setting up pve-qemu-kvm-build-deps (6.0.0-3) ...
lae at lilienne:~/build/pve-qemu$ make dinstall
test -f "qemu/configure" || git submodule update --init --recursive
Submodule 'qemu' (git://git.proxmox.com/git/mirror_qemu) registered for path 'qemu'
Cloning into '/home/lae/build/pve-qemu/qemu'...
Submodule path 'qemu': checked out '609d7596524ab204ccd71ef42c9eee4c7c338ea4'
Submodule 'capstone' (https://gitlab.com/qemu-project/capstone.git) registered for path 'qemu/capstone'
Submodule 'dtc' (https://gitlab.com/qemu-project/dtc.git) registered for path 'qemu/dtc'
Submodule 'meson' (https://gitlab.com/qemu-project/meson.git) registered for path 'qemu/meson'
Submodule 'roms/QemuMacDrivers' (https://gitlab.com/qemu-project/QemuMacDrivers.git) registered for path 'qemu/roms/QemuMacDrivers'
Submodule 'roms/SLOF' (https://gitlab.com/qemu-project/SLOF.git) registered for path 'qemu/roms/SLOF'
Submodule 'roms/edk2' (https://gitlab.com/qemu-project/edk2.git) registered for path 'qemu/roms/edk2'
Submodule 'roms/ipxe' (https://gitlab.com/qemu-project/ipxe.git) registered for path 'qemu/roms/ipxe'
Submodule 'roms/openbios' (https://gitlab.com/qemu-project/openbios.git) registered for path 'qemu/roms/openbios'
Submodule 'roms/opensbi' (https://gitlab.com/qemu-project/opensbi.git) registered for path 'qemu/roms/opensbi'
Submodule 'roms/qboot' (https://gitlab.com/qemu-project/qboot.git) registered for path 'qemu/roms/qboot'
Submodule 'roms/qemu-palcode' (https://gitlab.com/qemu-project/qemu-palcode.git) registered for path 'qemu/roms/qemu-palcode'
Submodule 'roms/seabios' (https://gitlab.com/qemu-project/seabios.git/) registered for path 'qemu/roms/seabios'
Submodule 'roms/seabios-hppa' (https://gitlab.com/qemu-project/seabios-hppa.git) registered for path 'qemu/roms/seabios-hppa'
Submodule 'roms/sgabios' (https://gitlab.com/qemu-project/sgabios.git) registered for path 'qemu/roms/sgabios'
Submodule 'roms/skiboot' (https://gitlab.com/qemu-project/skiboot.git) registered for path 'qemu/roms/skiboot'
Submodule 'roms/u-boot' (https://gitlab.com/qemu-project/u-boot.git) registered for path 'qemu/roms/u-boot'
Submodule 'roms/u-boot-sam460ex' (https://gitlab.com/qemu-project/u-boot-sam460ex.git) registered for path 'qemu/roms/u-boot-sam460ex'
Submodule 'roms/vbootrom' (https://gitlab.com/qemu-project/vbootrom.git) registered for path 'qemu/roms/vbootrom'
Submodule 'slirp' (https://gitlab.com/qemu-project/libslirp.git) registered for path 'qemu/slirp'
Submodule 'tests/fp/berkeley-softfloat-3' (https://gitlab.com/qemu-project/berkeley-softfloat-3.git) registered for path 'qemu/tests/fp/berkeley-softfloat-3'
Submodule 'tests/fp/berkeley-testfloat-3' (https://gitlab.com/qemu-project/berkeley-testfloat-3.git) registered for path 'qemu/tests/fp/berkeley-testfloat-3'
Submodule 'ui/keycodemapdb' (https://gitlab.com/qemu-project/keycodemapdb.git) registered for path 'qemu/ui/keycodemapdb'
Cloning into '/home/lae/build/pve-qemu/qemu/capstone'...
Cloning into '/home/lae/build/pve-qemu/qemu/dtc'...
Cloning into '/home/lae/build/pve-qemu/qemu/meson'...
Cloning into '/home/lae/build/pve-qemu/qemu/roms/QemuMacDrivers'...
Cloning into '/home/lae/build/pve-qemu/qemu/roms/SLOF'...
Cloning into '/home/lae/build/pve-qemu/qemu/roms/edk2'...
Cloning into '/home/lae/build/pve-qemu/qemu/roms/ipxe'...
Cloning into '/home/lae/build/pve-qemu/qemu/roms/openbios'...
Cloning into '/home/lae/build/pve-qemu/qemu/roms/opensbi'...
Cloning into '/home/lae/build/pve-qemu/qemu/roms/qboot'...
Cloning into '/home/lae/build/pve-qemu/qemu/roms/qemu-palcode'...
Cloning into '/home/lae/build/pve-qemu/qemu/roms/seabios'...
Cloning into '/home/lae/build/pve-qemu/qemu/roms/seabios-hppa'...
Cloning into '/home/lae/build/pve-qemu/qemu/roms/sgabios'...
Cloning into '/home/lae/build/pve-qemu/qemu/roms/skiboot'...
Cloning into '/home/lae/build/pve-qemu/qemu/roms/u-boot'...
Cloning into '/home/lae/build/pve-qemu/qemu/roms/u-boot-sam460ex'...
Cloning into '/home/lae/build/pve-qemu/qemu/roms/vbootrom'...
Cloning into '/home/lae/build/pve-qemu/qemu/slirp'...
Cloning into '/home/lae/build/pve-qemu/qemu/tests/fp/berkeley-softfloat-3'...
Cloning into '/home/lae/build/pve-qemu/qemu/tests/fp/berkeley-testfloat-3'...
Cloning into '/home/lae/build/pve-qemu/qemu/ui/keycodemapdb'...
Submodule path 'qemu/capstone': checked out 'f8b1b833015a4ae47110ed068e0deb7106ced66d'
Submodule path 'qemu/dtc': checked out '85e5d839847af54efab170f2b1331b2a6421e647'
Submodule path 'qemu/meson': checked out '776acd2a805c9b42b4f0375150977df42130317f'
Submodule path 'qemu/roms/QemuMacDrivers': checked out '90c488d5f4a407342247b9ea869df1c2d9c8e266'
Submodule path 'qemu/roms/SLOF': checked out '33a7322de13e9dca4b38851a345a58d37e7a441d'
Submodule path 'qemu/roms/edk2': checked out '06dc822d045c2bb42e497487935485302486e151'
Submodule 'SoftFloat' (https://github.com/ucb-bar/berkeley-softfloat-3.git) registered for path 'qemu/roms/edk2/ArmPkg/Library/ArmSoftFloatLib/berkeley-softfloat-3'
Submodule 'BaseTools/Source/C/BrotliCompress/brotli' (https://github.com/google/brotli) registered for path 'qemu/roms/edk2/BaseTools/Source/C/BrotliCompress/brotli'
Submodule 'CryptoPkg/Library/OpensslLib/openssl' (https://github.com/openssl/openssl) registered for path 'qemu/roms/edk2/CryptoPkg/Library/OpensslLib/openssl'
Submodule 'MdeModulePkg/Library/BrotliCustomDecompressLib/brotli' (https://github.com/google/brotli) registered for path 'qemu/roms/edk2/MdeModulePkg/Library/BrotliCustomDecompressLib/brotli'
Submodule 'MdeModulePkg/Universal/RegularExpressionDxe/oniguruma' (https://github.com/kkos/oniguruma) registered for path 'qemu/roms/edk2/MdeModulePkg/Universal/RegularExpressionDxe/oniguruma'
Submodule 'UnitTestFrameworkPkg/Library/CmockaLib/cmocka' (https://git.cryptomilk.org/projects/cmocka.git) registered for path 'qemu/roms/edk2/UnitTestFrameworkPkg/Library/CmockaLib/cmocka'
Cloning into '/home/lae/build/pve-qemu/qemu/roms/edk2/ArmPkg/Library/ArmSoftFloatLib/berkeley-softfloat-3'...
Cloning into '/home/lae/build/pve-qemu/qemu/roms/edk2/BaseTools/Source/C/BrotliCompress/brotli'...
Cloning into '/home/lae/build/pve-qemu/qemu/roms/edk2/CryptoPkg/Library/OpensslLib/openssl'...
Cloning into '/home/lae/build/pve-qemu/qemu/roms/edk2/MdeModulePkg/Library/BrotliCustomDecompressLib/brotli'...
Cloning into '/home/lae/build/pve-qemu/qemu/roms/edk2/MdeModulePkg/Universal/RegularExpressionDxe/oniguruma'...
Cloning into '/home/lae/build/pve-qemu/qemu/roms/edk2/UnitTestFrameworkPkg/Library/CmockaLib/cmocka'...
Submodule path 'qemu/roms/edk2/ArmPkg/Library/ArmSoftFloatLib/berkeley-softfloat-3': checked out 'b64af41c3276f97f0e181920400ee056b9c88037'
Submodule path 'qemu/roms/edk2/BaseTools/Source/C/BrotliCompress/brotli': checked out '666c3280cc11dc433c303d79a83d4ffbdd12cc8d'
Submodule 'research/esaxx' (https://github.com/hillbig/esaxx) registered for path 'qemu/roms/edk2/BaseTools/Source/C/BrotliCompress/brotli/research/esaxx'
Submodule 'research/libdivsufsort' (https://github.com/y-256/libdivsufsort.git) registered for path 'qemu/roms/edk2/BaseTools/Source/C/BrotliCompress/brotli/research/libdivsufsort'
Cloning into '/home/lae/build/pve-qemu/qemu/roms/edk2/BaseTools/Source/C/BrotliCompress/brotli/research/esaxx'...
Cloning into '/home/lae/build/pve-qemu/qemu/roms/edk2/BaseTools/Source/C/BrotliCompress/brotli/research/libdivsufsort'...
Submodule path 'qemu/roms/edk2/BaseTools/Source/C/BrotliCompress/brotli/research/esaxx': checked out 'ca7cb332011ec37a8436487f210f396b84bd8273'
Submodule path 'qemu/roms/edk2/BaseTools/Source/C/BrotliCompress/brotli/research/libdivsufsort': checked out '5f60d6f026c30fb4ac296f696b3c8b0eb71bd428'
Submodule path 'qemu/roms/edk2/CryptoPkg/Library/OpensslLib/openssl': checked out 'e2e09d9fba1187f8d6aafaa34d4172f56f1ffb72'
Submodule 'boringssl' (https://boringssl.googlesource.com/boringssl) registered for path 'qemu/roms/edk2/CryptoPkg/Library/OpensslLib/openssl/boringssl'
Submodule 'krb5' (https://github.com/krb5/krb5) registered for path 'qemu/roms/edk2/CryptoPkg/Library/OpensslLib/openssl/krb5'
Submodule 'pyca.cryptography' (https://github.com/pyca/cryptography.git) registered for path 'qemu/roms/edk2/CryptoPkg/Library/OpensslLib/openssl/pyca-cryptography'
Cloning into '/home/lae/build/pve-qemu/qemu/roms/edk2/CryptoPkg/Library/OpensslLib/openssl/boringssl'...
Cloning into '/home/lae/build/pve-qemu/qemu/roms/edk2/CryptoPkg/Library/OpensslLib/openssl/krb5'...
Cloning into '/home/lae/build/pve-qemu/qemu/roms/edk2/CryptoPkg/Library/OpensslLib/openssl/pyca-cryptography'...
Submodule path 'qemu/roms/edk2/CryptoPkg/Library/OpensslLib/openssl/boringssl': checked out '2070f8ad9151dc8f3a73bffaa146b5e6937a583f'
Submodule path 'qemu/roms/edk2/CryptoPkg/Library/OpensslLib/openssl/krb5': checked out '890ca2f401924cdcb88f493950b04700bbe52db3'
Submodule path 'qemu/roms/edk2/CryptoPkg/Library/OpensslLib/openssl/pyca-cryptography': checked out '09403100de2f6f1cdd0d484dcb8e620f1c335c8f'
Submodule path 'qemu/roms/edk2/MdeModulePkg/Library/BrotliCustomDecompressLib/brotli': checked out '666c3280cc11dc433c303d79a83d4ffbdd12cc8d'
Submodule 'research/esaxx' (https://github.com/hillbig/esaxx) registered for path 'qemu/roms/edk2/MdeModulePkg/Library/BrotliCustomDecompressLib/brotli/research/esaxx'
Submodule 'research/libdivsufsort' (https://github.com/y-256/libdivsufsort.git) registered for path 'qemu/roms/edk2/MdeModulePkg/Library/BrotliCustomDecompressLib/brotli/research/libdivsufsort'
Cloning into '/home/lae/build/pve-qemu/qemu/roms/edk2/MdeModulePkg/Library/BrotliCustomDecompressLib/brotli/research/esaxx'...
Cloning into '/home/lae/build/pve-qemu/qemu/roms/edk2/MdeModulePkg/Library/BrotliCustomDecompressLib/brotli/research/libdivsufsort'...
Submodule path 'qemu/roms/edk2/MdeModulePkg/Library/BrotliCustomDecompressLib/brotli/research/esaxx': checked out 'ca7cb332011ec37a8436487f210f396b84bd8273'
Submodule path 'qemu/roms/edk2/MdeModulePkg/Library/BrotliCustomDecompressLib/brotli/research/libdivsufsort': checked out '5f60d6f026c30fb4ac296f696b3c8b0eb71bd428'
Submodule path 'qemu/roms/edk2/MdeModulePkg/Universal/RegularExpressionDxe/oniguruma': checked out 'abfc8ff81df4067f309032467785e06975678f0d'
Submodule path 'qemu/roms/edk2/UnitTestFrameworkPkg/Library/CmockaLib/cmocka': checked out '1cc9cde3448cdd2e000886a26acf1caac2db7cf1'
Submodule path 'qemu/roms/ipxe': checked out '4bd064de239dab2426b31c9789a1f4d78087dc63'
Submodule path 'qemu/roms/openbios': checked out '4a0041107b8ef77e0e8337bfcb5f8078887261a7'
Submodule path 'qemu/roms/opensbi': checked out '234ed8e427f4d92903123199f6590d144e0d9351'
Submodule path 'qemu/roms/qboot': checked out 'a5300c4949b8d4de2d34bedfaed66793f48ec948'
Submodule path 'qemu/roms/qemu-palcode': checked out 'bf0e13698872450164fa7040da36a95d2d4b326f'
Submodule path 'qemu/roms/seabios': checked out '155821a1990b6de78dde5f98fa5ab90e802021e0'
Submodule path 'qemu/roms/seabios-hppa': checked out '73b740f77190643b2ada5ee97a9a108c6ef2a37b'
Submodule path 'qemu/roms/sgabios': checked out 'cbaee52287e5f32373181cff50a00b6c4ac9015a'
Submodule path 'qemu/roms/skiboot': checked out '3a6fdede6ce117facec0108afe716cf5d0472c3f'
Submodule path 'qemu/roms/u-boot': checked out 'd3689267f92c5956e09cc7d1baa4700141662bff'
Submodule path 'qemu/roms/u-boot-sam460ex': checked out '60b3916f33e617a815973c5a6df77055b2e3a588'
Submodule path 'qemu/roms/vbootrom': checked out '0c37a43527f0ee2b9584e7fb2fdc805e902635ac'
Submodule path 'qemu/slirp': checked out '8f43a99191afb47ca3f3c6972f6306209f367ece'
Submodule path 'qemu/tests/fp/berkeley-softfloat-3': checked out 'b64af41c3276f97f0e181920400ee056b9c88037'
Submodule path 'qemu/tests/fp/berkeley-testfloat-3': checked out '5a59dcec19327396a011a17fd924aed4fec416b3'
Submodule path 'qemu/ui/keycodemapdb': checked out '6119e6e19a050df847418de7babe5166779955e4'
# check if qemu/ was used for a build
# if so, please run 'make distclean' in the submodule and try again
test ! -f qemu/build/config.status
rm -rf pve-qemu-kvm-6.0.0
cp -a qemu pve-qemu-kvm-6.0.0
cp -a debian pve-qemu-kvm-6.0.0/debian
rm -rf pve-qemu-kvm-6.0.0/ui/keycodemapdb
cp -a keycodemapdb pve-qemu-kvm-6.0.0/ui/
echo "git clone git://git.proxmox.com/git/pve-qemu.git\\ngit checkout 277d33454f77ec1d1e0bc04e37621e4dd2424b67" > pve-qemu-kvm-6.0.0/debian/SOURCE
cd pve-qemu-kvm-6.0.0; dpkg-buildpackage -b -us -uc -j
dpkg-buildpackage: info: source package pve-qemu-kvm
dpkg-buildpackage: info: source version 6.0.0-3
dpkg-buildpackage: info: source distribution bullseye
dpkg-buildpackage: info: source changed by Proxmox Support Team <support at proxmox.com>
dpkg-buildpackage: info: host architecture amd64
 dpkg-source --before-build .
dpkg-source: info: using patch list from debian/patches/series
dpkg-source: info: applying extra/0001-monitor-qmp-fix-race-on-CHR_EVENT_CLOSED-without-OOB.patch
dpkg-source: info: applying extra/0002-block-io_uring-resubmit-when-result-is-EAGAIN.patch
dpkg-source: info: applying bitmap-mirror/0001-drive-mirror-add-support-for-sync-bitmap-mode-never.patch
dpkg-source: info: applying bitmap-mirror/0002-drive-mirror-add-support-for-conditional-and-always-.patch
dpkg-source: info: applying bitmap-mirror/0003-mirror-add-check-for-bitmap-mode-without-bitmap.patch
dpkg-source: info: applying bitmap-mirror/0004-mirror-switch-to-bdrv_dirty_bitmap_merge_internal.patch
dpkg-source: info: applying bitmap-mirror/0005-iotests-add-test-for-bitmap-mirror.patch
dpkg-source: info: applying bitmap-mirror/0006-mirror-move-some-checks-to-qmp.patch
dpkg-source: info: applying pve/0001-PVE-Config-block-file-change-locking-default-to-off.patch
dpkg-source: info: applying pve/0002-PVE-Config-Adjust-network-script-path-to-etc-kvm.patch
dpkg-source: info: applying pve/0003-PVE-Config-set-the-CPU-model-to-kvm64-32-instead-of-.patch
dpkg-source: info: applying pve/0004-PVE-Config-ui-spice-default-to-pve-certificates.patch
dpkg-source: info: applying pve/0005-PVE-Config-glusterfs-no-default-logfile-if-daemonize.patch
dpkg-source: info: applying pve/0006-PVE-Config-rbd-block-rbd-disable-rbd_cache_writethro.patch
dpkg-source: info: applying pve/0007-PVE-Up-qmp-add-get_link_status.patch
dpkg-source: info: applying pve/0008-PVE-Up-glusterfs-allow-partial-reads.patch
dpkg-source: info: applying pve/0009-PVE-Up-qemu-img-return-success-on-info-without-snaps.patch
dpkg-source: info: applying pve/0010-PVE-Up-qemu-img-dd-add-osize-and-read-from-to-stdin-.patch
dpkg-source: info: applying pve/0011-PVE-Up-qemu-img-dd-add-isize-parameter.patch
dpkg-source: info: applying pve/0012-PVE-Up-qemu-img-dd-add-n-skip_create.patch
dpkg-source: info: applying pve/0013-PVE-virtio-balloon-improve-query-balloon.patch
dpkg-source: info: applying pve/0014-PVE-qapi-modify-query-machines.patch
dpkg-source: info: applying pve/0015-PVE-qapi-modify-spice-query.patch
dpkg-source: info: applying pve/0016-PVE-add-savevm-async-for-background-state-snapshots.patch
dpkg-source: info: applying pve/0017-PVE-add-optional-buffer-size-to-QEMUFile.patch
dpkg-source: info: applying pve/0018-PVE-block-add-the-zeroinit-block-driver-filter.patch
dpkg-source: info: applying pve/0019-PVE-Add-dummy-id-command-line-parameter.patch
dpkg-source: info: applying pve/0020-PVE-Config-Revert-target-i386-disable-LINT0-after-re.patch
dpkg-source: info: applying pve/0021-PVE-Up-Config-file-posix-make-locking-optiono-on-cre.patch
dpkg-source: info: applying pve/0022-PVE-monitor-disable-oob-capability.patch
dpkg-source: info: applying pve/0023-PVE-Compat-4.0-used-balloon-qemu-4-0-config-size-fal.patch
dpkg-source: info: applying pve/0024-PVE-Allow-version-code-in-machine-type.patch
dpkg-source: info: applying pve/0025-PVE-Backup-add-vma-backup-format-code.patch
dpkg-source: info: applying pve/0026-PVE-Backup-add-backup-dump-block-driver.patch
dpkg-source: info: applying pve/0027-PVE-Backup-proxmox-backup-patches-for-qemu.patch
dpkg-source: info: applying pve/0028-PVE-Backup-pbs-restore-new-command-to-restore-from-p.patch
dpkg-source: info: applying pve/0029-PVE-Backup-Add-dirty-bitmap-tracking-for-incremental.patch
dpkg-source: info: applying pve/0030-PVE-various-PBS-fixes.patch
dpkg-source: info: applying pve/0031-PVE-Add-PBS-block-driver-to-map-backup-archives-into.patch
dpkg-source: info: applying pve/0032-PVE-add-query_proxmox_support-QMP-command.patch
dpkg-source: info: applying pve/0033-PVE-add-query-pbs-bitmap-info-QMP-call.patch
dpkg-source: info: applying pve/0034-PVE-redirect-stderr-to-journal-when-daemonized.patch
dpkg-source: info: applying pve/0035-PVE-Add-sequential-job-transaction-support.patch
dpkg-source: info: applying pve/0036-PVE-Backup-Use-a-transaction-to-synchronize-job-stat.patch
dpkg-source: info: applying pve/0037-PVE-Backup-Don-t-block-on-finishing-and-cleanup-crea.patch
dpkg-source: info: applying pve/0038-PVE-Migrate-dirty-bitmap-state-via-savevm.patch
dpkg-source: info: applying pve/0039-migration-block-dirty-bitmap-migrate-other-bitmaps-e.patch
dpkg-source: info: applying pve/0040-PVE-fall-back-to-open-iscsi-initiatorname.patch
dpkg-source: info: applying pve/0041-PVE-Use-coroutine-QMP-for-backup-cancel_backup.patch
dpkg-source: info: applying pve/0042-PBS-add-master-key-support.patch
dpkg-source: info: applying pve/0043-PVE-block-pbs-fast-path-reads-without-allocation-if-.patch
dpkg-source: info: applying pve/0044-PVE-block-stream-increase-chunk-size.patch
dpkg-source: info: applying pve/0045-block-io-accept-NULL-qiov-in-bdrv_pad_request.patch
dpkg-source: info: applying pve/0046-block-add-alloc-track-driver.patch
dpkg-source: info: applying pve/0047-PVE-whitelist-invalid-QAPI-names-for-backwards-compa.patch
dpkg-source: info: applying pve/0048-PVE-savevm-async-register-yank-before-migration_inco.patch
 fakeroot debian/rules clean
make[1]: Entering directory '/home/lae/build/pve-qemu/pve-qemu-kvm-6.0.0'
dh_testdir
dh_testroot
rm -f build-stamp
# Add here commands to clean up after the build process.
/usr/bin/make distclean
make[2]: Entering directory '/home/lae/build/pve-qemu/pve-qemu-kvm-6.0.0'
rm -f config.mak op-i386.h opc-i386.h gen-op-i386.h op-arm.h opc-arm.h gen-op-arm.h
find . \( -name '*.so' -o -name '*.dll' -o -name '*.[oda]' \) -type f \
        ! -path ./roms/edk2/ArmPkg/Library/GccLto/liblto-aarch64.a \
        ! -path ./roms/edk2/ArmPkg/Library/GccLto/liblto-arm.a \
        -exec rm {} +
rm -f TAGS cscope.* *.pod *~ */*~
rm -f fsdev/*.pod scsi/*.pod
rm -f config-host.mak config-host.h*
rm -f tests/tcg/config-*.mak
rm -f config-all-disas.mak config.status
rm -f roms/seabios/config.mak roms/vgabios/config.mak
rm -f qemu-plugins-ld.symbols qemu-plugins-ld64.symbols
rm -f *-config-target.h *-config-devices.mak *-config-devices.h
rm -rf meson-private meson-logs meson-info compile_commands.json
rm -f Makefile.ninja Makefile.mtest build.ninja.stamp meson.stamp
rm -f config.log
rm -f linux-headers/asm
rm -Rf .sdk
make[2]: Leaving directory '/home/lae/build/pve-qemu/pve-qemu-kvm-6.0.0'
cp -f /usr/share/misc/config.sub config.sub
cp -f /usr/share/misc/config.guess config.guess
dh_clean
make[1]: Leaving directory '/home/lae/build/pve-qemu/pve-qemu-kvm-6.0.0'
 debian/rules build
make[1]: Entering directory '/home/lae/build/pve-qemu/pve-qemu-kvm-6.0.0'
dh_testdir
# Add here commands to configure the package.
# guest-agent is only required for guest systems
./configure \
--with-git-submodules=ignore \
--docdir=/usr/share/doc/pve-qemu-kvm \
--localstatedir=/var \
--prefix=/usr \
--sysconfdir=/etc \
--target-list=x86_64-softmmu,aarch64-softmmu \
--with-suffix="kvm" \
--with-pkgversion="pve-qemu-kvm_6.0.0" \
--audio-drv-list="alsa,pa" \
--datadir=/usr/share \
--libexecdir=/usr/lib/kvm \
--disable-capstone \
--disable-gtk \
--disable-guest-agent \
--disable-guest-agent-msi \
--disable-libnfs \
--disable-libxml2 \
--disable-sdl \
--disable-smartcard \
--disable-strip \
--disable-xen \
--enable-curl \
--enable-docs \
--enable-glusterfs \
--enable-gnutls \
--enable-libiscsi \
--enable-libusb \
--enable-linux-aio \
--enable-linux-io-uring \
--enable-numa \
--enable-rbd \
--enable-seccomp \
--enable-spice \
--enable-usb-redir \
--enable-virtfs \
--enable-virtiofsd \
--enable-xfsctl
Using './build' as the directory for build output
The Meson build system
Version: 0.56.2
Source dir: /home/lae/build/pve-qemu/pve-qemu-kvm-6.0.0
Build dir: /home/lae/build/pve-qemu/pve-qemu-kvm-6.0.0/build
Build type: native build
Project name: qemu
Project version: 6.0.0
C compiler for the host machine: cc (gcc 10.2.1 "cc (Debian 10.2.1-6) 10.2.1 20210110")
C linker for the host machine: cc ld.bfd 2.35.2
Host machine cpu family: x86_64
Host machine cpu: x86_64
Program sh found: YES (/usr/bin/sh)
Program python3 found: YES (/usr/bin/python3)
Program bzip2 found: YES (/usr/bin/bzip2)
C++ compiler for the host machine: c++ (gcc 10.2.1 "c++ (Debian 10.2.1-6) 10.2.1 20210110")
C++ linker for the host machine: c++ ld.bfd 2.35.2
Program cgcc found: NO
Library m found: YES
Library util found: YES
Run-time dependency appleframeworks found: NO (tried framework)
Found pkg-config: /usr/bin/pkg-config (0.29.2)
Run-time dependency pixman-1 found: YES 0.40.0
Library aio found: YES
Run-time dependency zlib found: YES 1.2.11
Dependency libnfs skipped: feature libnfs disabled
Run-time dependency appleframeworks found: NO (tried framework)
Run-time dependency libseccomp found: YES 2.5.1
Has header "cap-ng.h" : YES
Library cap-ng found: YES
Run-time dependency xkbcommon found: NO (tried pkgconfig)
Library rt found: YES
Run-time dependency libiscsi found: YES 1.19.0
Run-time dependency libzstd found: NO (tried pkgconfig)
Run-time dependency libcurl found: YES 7.74.0
Run-time dependency libudev found: YES 247
Library mpathpersist found: NO
Run-time dependency ncursesw found: YES 6.2.20201114
Has header "brlapi.h" : YES
Library brlapi found: YES
Dependency sdl2 skipped: feature sdl disabled
Library rados found: YES
Has header "rbd/librbd.h" : YES
Library rbd found: YES
Run-time dependency glusterfs-api found: YES 7.9.2
Has header "bzlib.h" : NO
Has header "lzfse.h" : NO
Dependency gtk+-3.0 skipped: feature gtk disabled
Run-time dependency libpng found: YES 1.6.37
Run-time dependency libjpeg found: YES 2.0.6
Has header "sasl/sasl.h" : YES
Library sasl2 found: YES
Has header "snappy-c.h" : NO
Has header "lzo/lzo1x.h" : NO
Run-time dependency u2f-emu found: NO (tried pkgconfig)
Run-time dependency libkeyutils found: NO (tried pkgconfig)
Checking for function "gettid" : YES
Library uuid found: YES
Library systemd found: YES
Library proxmox_backup_qemu found: YES
Run-time dependency fuse3 found: NO (tried pkgconfig)
Has header "linux/btrfs.h" : YES
Has header "libdrm/drm.h" : YES
Has header "pty.h" : YES
Has header "sys/ioccom.h" : NO
Has header "sys/kcov.h" : NO
Checking for function "system" : YES
Checking for function "preadv" : YES
Program scripts/minikconf.py found: YES (/usr/bin/python3 /home/lae/build/pve-qemu/pve-qemu-kvm-6.0.0/scripts/minikconf.py)
Configuring x86_64-softmmu-config-target.h using configuration
Configuring x86_64-softmmu-config-devices.mak with command
Reading depfile: /home/lae/build/pve-qemu/pve-qemu-kvm-6.0.0/build/meson-private/x86_64-softmmu-config-devices.mak.d
Configuring x86_64-softmmu-config-devices.h using configuration
Configuring aarch64-softmmu-config-target.h using configuration
Configuring aarch64-softmmu-config-devices.mak with command
Reading depfile: /home/lae/build/pve-qemu/pve-qemu-kvm-6.0.0/build/meson-private/aarch64-softmmu-config-devices.mak.d
Configuring aarch64-softmmu-config-devices.h using configuration
Run-time dependency slirp found: YES 4.4.0
Library fdt found: YES
Configuring config-host.h using configuration
Program scripts/hxtool found: YES (/home/lae/build/pve-qemu/pve-qemu-kvm-6.0.0/scripts/hxtool)
Program scripts/shaderinclude.pl found: YES (/usr/bin/env perl /home/lae/build/pve-qemu/pve-qemu-kvm-6.0.0/scripts/shaderinclude.pl)
Program scripts/qapi-gen.py found: YES (/usr/bin/python3 /home/lae/build/pve-qemu/pve-qemu-kvm-6.0.0/scripts/qapi-gen.py)
Program scripts/qemu-version.sh found: YES (/home/lae/build/pve-qemu/pve-qemu-kvm-6.0.0/scripts/qemu-version.sh)

|Executing subproject libvhost-user method meson
|
|Project name: libvhost-user
|Project version: undefined
|C compiler for the host machine: cc (gcc 10.2.1 "cc (Debian 10.2.1-6) 10.2.1 20210110")
|C linker for the host machine: cc ld.bfd 2.35.2
|Run-time dependency threads found: YES
|Dependency glib-2.0 found: YES 6.0.0 (overridden)
|Build targets in project: 8
|Subproject libvhost-user finished.

Dependency threads found: YES unknown (cached)
Program keycodemapdb/tools/keymap-gen found: YES (/home/lae/build/pve-qemu/pve-qemu-kvm-6.0.0/ui/keycodemapdb/tools/keymap-gen)
Program scripts/decodetree.py found: YES (/usr/bin/python3 /home/lae/build/pve-qemu/pve-qemu-kvm-6.0.0/scripts/decodetree.py)
Program ../scripts/modules/module_block.py found: YES (/usr/bin/python3 /home/lae/build/pve-qemu/pve-qemu-kvm-6.0.0/block/../scripts/modules/module_block.py)
Program ../scripts/block-coroutine-wrapper.py found: YES (/usr/bin/python3 /home/lae/build/pve-qemu/pve-qemu-kvm-6.0.0/block/../scripts/block-coroutine-wrapper.py)
Program nm found: YES
Program scripts/undefsym.py found: YES (/usr/bin/python3 /home/lae/build/pve-qemu/pve-qemu-kvm-6.0.0/scripts/undefsym.py)
Program scripts/feature_to_c.sh found: YES (/bin/sh /home/lae/build/pve-qemu/pve-qemu-kvm-6.0.0/scripts/feature_to_c.sh)
Library ibumad found: YES
Configuring 50-qemu-gpu.json using configuration
Configuring 50-qemu-virtiofsd.json using configuration
Configuring 50-edk2-i386-secure.json using configuration
Configuring 50-edk2-x86_64-secure.json using configuration
Configuring 60-edk2-aarch64.json using configuration
Configuring 60-edk2-arm.json using configuration
Configuring 60-edk2-i386.json using configuration
Configuring 60-edk2-x86_64.json using configuration
Program qemu-keymap found: NO
Program sphinx-build found: YES (/usr/bin/sphinx-build)
Program python3 found: YES (/usr/bin/python3)
Program diff found: YES (/usr/bin/diff)
Program dbus-daemon found: YES (/usr/bin/dbus-daemon)
Program initrd-stress.sh found: YES (/home/lae/build/pve-qemu/pve-qemu-kvm-6.0.0/tests/migration/initrd-stress.sh)
Build targets in project: 465

qemu 6.0.0

  Directories
                   Install prefix: /usr
                   BIOS directory: share/kvm
                    firmware path: /usr/share/qemu-firmware
                 binary directory: bin
                library directory: lib
                 module directory: lib/kvm
                libexec directory: lib/kvm
                include directory: include
                 config directory: /etc
            local state directory: /var
                 Manual directory: share/man
                    Doc directory: /usr/share/doc/pve-qemu-kvm
                  Build directory: /home/lae/build/pve-qemu/pve-qemu-kvm-6.0.0/build
                      Source path: /home/lae/build/pve-qemu/pve-qemu-kvm-6.0.0
                   GIT submodules: ui/keycodemapdb tests/fp/berkeley-testfloat-3 tests/fp/berkeley-softfloat-3

  Host binaries
                              git: git
                             make: make
                           python: /usr/bin/python3 (version: 3.9)
                     sphinx-build: YES
                      genisoimage: /usr/bin/genisoimage
                             smbd: "/usr/sbin/smbd"

  Configurable features
                    Documentation: YES
            system-mode emulation: YES
              user-mode emulation: NO
                      block layer: YES
                    Install blobs: YES
                   module support: NO
                   plugin support: NO
                  fuzzing support: NO
                    Audio drivers: alsa pa
                   Trace backends: log
                    QOM debugging: YES
             vhost-kernel support: YES
                vhost-net support: YES
             vhost-crypto support: YES
               vhost-scsi support: YES
              vhost-vsock support: YES
               vhost-user support: YES
    vhost-user-blk server support: YES
            vhost-user-fs support: YES
               vhost-vdpa support: YES
                build guest agent: NO

  Compilation
                         host CPU: x86_64
                  host endianness: little
                       C compiler: cc
                  Host C compiler: cc
                     C++ compiler: c++
                          ARFLAGS: rv
                           CFLAGS: -O2 -g
                         CXXFLAGS: -O2 -g
                      QEMU_CFLAGS: -U_FORTIFY_SOURCE -D_FORTIFY_SOURCE=2 -m64 -mcx16 -D_GNU_SOURCE -D_FILE_OFFSET_BITS=64 -D_LARGEFILE_SOURCE -Wstrict-prototypes -Wredundant-decls -Wundef -Wwrite-strings -Wmissing-prototypes -fno-strict-aliasing -fno-common -fwrapv  -Wold-style-declaration -Wold-style-definition -Wtype-limits -Wformat-security -Wformat-y2k -Winit-self -Wignored-qualifiers -Wempty-body -Wnested-externs -Wendif-labels -Wexpansion-to-defined -Wimplicit-fallthrough=2 -Wno-missing-include-dirs -Wno-shift-negative-value -Wno-psabi -fstack-protector-strong
                     QEMU_LDFLAGS: -Wl,--warn-common -Wl,-z,relro -Wl,-z,now -m64  -fstack-protector-strong
                         profiler: NO
     link-time optimization (LTO): NO
                              PIE: YES
                     static build: NO
              malloc trim support: YES
                       membarrier: NO
                   preadv support: YES
                        fdatasync: YES
                          madvise: YES
                    posix_madvise: YES
                   posix_memalign: YES
                debug stack usage: NO
                  mutex debugging: NO
                 memory allocator: system
                avx2 optimization: YES
             avx512f optimization: NO
                    gprof enabled: NO
                             gcov: NO
                 thread sanitizer: NO
                      CFI support: NO
                   strip binaries: NO
                           sparse: NO
                  mingw32 support: NO
                     x86_64 tests: cc

  Targets and accelerators
                      KVM support: YES
                      HAX support: NO
                      HVF support: NO
                     WHPX support: NO
                      Xen support: NO
                      TCG support: YES
                      TCG backend: native (x86_64)
                TCG debug enabled: NO
                      target list: x86_64-softmmu aarch64-softmmu
                  default devices: YES
         out of process emulation: YES

  Block layer support
                coroutine backend: ucontext
                   coroutine pool: YES
             Block whitelist (rw):
             Block whitelist (ro):
                   VirtFS support: YES
            build virtiofs daemon: YES
             Live block migration: YES
              replication support: YES
                    bochs support: YES
                    cloop support: YES
                      dmg support: YES
                  qcow v1 support: YES
                      vdi support: YES
                    vvfat support: YES
                      qed support: YES
                parallels support: YES
                 sheepdog support: NO
                     FUSE exports: NO

  Crypto
                     TLS priority: "NORMAL"
                   GNUTLS support: YES
                        libgcrypt: NO
                           nettle: YES
                              XTS: YES
                     crypto afalg: NO
                         rng-none: NO
                    Linux keyring: YES

  Dependencies
                      SDL support: NO
                SDL image support: NO
                      GTK support: NO
                           pixman: YES
                      VTE support: NO
                    slirp support: system
                         libtasn1: YES
                              PAM: NO
                    iconv support: YES
                   curses support: YES
                    virgl support: YES
                     curl support: YES
                Multipath support: NO
                      VNC support: YES
                 VNC SASL support: YES
                 VNC JPEG support: YES
                  VNC PNG support: YES
                   brlapi support: YES
                      vde support: YES
                   netmap support: NO
                Linux AIO support: YES
           Linux io_uring support: YES
               ATTR/XATTR support: YES
                     RDMA support: YES
                   PVRDMA support: YES
                      fdt support: system
                libcap-ng support: YES
                    spice support: YES
                      rbd support: YES
                   xfsctl support: YES
                smartcard support: NO
                      U2F support: NO
                           libusb: YES
                    usb net redir: YES
                   OpenGL support: YES
                              GBM: YES
                 libiscsi support: YES
                   libnfs support: NO
                  seccomp support: YES
                GlusterFS support: YES
                      TPM support: YES
                   libssh support: YES
                      lzo support: NO
                   snappy support: NO
                    bzip2 support: NO
                    lzfse support: NO
                     zstd support: NO
                NUMA host support: YES
                          libxml2: NO
                 PBS bdrv support: YES
                         capstone: NO
                  libpmem support: YES
                libdaxctl support: NO
                          libudev: YES
                       FUSE lseek: NO

  Subprojects
                    libvhost-user: YES

Found ninja-1.10.1 at /usr/bin/ninja
dh_testdir
# Add here commands to compile the package.
/usr/bin/make
make[2]: Entering directory '/home/lae/build/pve-qemu/pve-qemu-kvm-6.0.0'
changing dir to build for /usr/bin/make ""...
make[3]: Entering directory '/home/lae/build/pve-qemu/pve-qemu-kvm-6.0.0/build'
  GIT     ui/keycodemapdb tests/fp/berkeley-testfloat-3 tests/fp/berkeley-softfloat-3
/usr/bin/ninja  build.ninja && touch build.ninja.stamp
ninja: no work to do.
/usr/bin/meson introspect --targets --tests --benchmarks | /usr/bin/python3 -B scripts/mtest2make.py > Makefile.mtest
  GIT     ui/keycodemapdb tests/fp/berkeley-testfloat-3 tests/fp/berkeley-softfloat-3
  AS      multiboot.o
  AS      linuxboot.o
  CC      linuxboot_dma.o
  AS      kvmvapic.o
  AS      pvh.o
  CC      pvh_main.o
  BUILD   multiboot.img
  BUILD   linuxboot.img
  BUILD   kvmvapic.img
  BUILD   multiboot.raw
  BUILD   linuxboot.raw
  BUILD   kvmvapic.raw
  SIGN    multiboot.bin
  BUILD   linuxboot_dma.img
  SIGN    linuxboot.bin
  SIGN    kvmvapic.bin
  BUILD   linuxboot_dma.raw
  SIGN    linuxboot_dma.bin
  BUILD   pvh.img
  BUILD   pvh.raw
  SIGN    pvh.bin
[1/2951] Generating trace-hw_alpha.h with a custom command
[2/2951] Generating trace-hw_adc.h with a custom command
[3/2951] Generating trace-crypto.c with a custom command
[4/2951] Generating trace-qapi.c with a custom command
[5/2951] Generating trace-qom.c with a custom command
[6/2951] Generating trace-backends_tpm.c with a custom command
[7/2951] Generating trace-chardev.c with a custom command
[8/2951] Generating trace-hw_9pfs.c with a custom command
[9/2951] Generating trace-hw_adc.c with a custom command
[10/2951] Generating trace-chardev.h with a custom command
[11/2951] Generating trace-crypto.h with a custom command
[12/2951] Generating trace-qom.h with a custom command
[13/2951] Compiling C object subprojects/libvhost-user/link-test.p/link-test.c.o
[14/2951] Generating trace-hw_ide.c with a custom command
[15/2951] Generating trace-hw_acpi.c with a custom command
[16/2951] Generating trace-qapi.h with a custom command
[17/2951] Generating trace-hw_s390x.c with a custom command
[18/2951] Generating trace-hw_acpi.h with a custom command
[19/2951] Generating trace-root.c with a custom command
[20/2951] Generating trace-root.h with a custom command
[21/2951] Generating trace-hw_9pfs.h with a custom command
[22/2951] Generating trace-monitor.c with a custom command
[23/2951] Generating trace-monitor.h with a custom command
[24/2951] Generating trace-hw_scsi.c with a custom command
[25/2951] Generating trace-authz.c with a custom command
[26/2951] Generating trace-authz.h with a custom command
[27/2951] Generating trace-util.h with a custom command
[28/2951] Generating trace-util.c with a custom command
[29/2951] Generating trace-scsi.h with a custom command
[30/2951] Generating trace-scsi.c with a custom command
[31/2951] Generating trace-io.c with a custom command
[32/2951] Generating trace-accel_kvm.c with a custom command
[33/2951] Generating trace-nbd.c with a custom command
[34/2951] Generating trace-backends.h with a custom command
[35/2951] Generating trace-accel_kvm.h with a custom command
[36/2951] Generating trace-audio.h with a custom command
[37/2951] Generating trace-audio.c with a custom command
[38/2951] Generating trace-hw_alpha.c with a custom command
[39/2951] Generating trace-block.c with a custom command
[40/2951] Generating trace-io.h with a custom command
[41/2951] Generating trace-backends_tpm.h with a custom command
[42/2951] Generating trace-hw_arm.c with a custom command
[43/2951] Generating trace-hw_scsi.h with a custom command
[44/2951] Generating trace-block.h with a custom command
[45/2951] Generating trace-nbd.h with a custom command
[46/2951] Generating trace-backends.c with a custom command
[47/2951] Generating trace-hw_audio.h with a custom command
[48/2951] Generating trace-hw_audio.c with a custom command
[49/2951] Generating trace-hw_block_dataplane.h with a custom command
[50/2951] Generating trace-hw_block_dataplane.c with a custom command
[51/2951] Generating trace-hw_char.c with a custom command
[52/2951] Generating trace-hw_dma.c with a custom command
[53/2951] Generating trace-hw_hppa.h with a custom command
[54/2951] Generating trace-hw_arm.h with a custom command
[55/2951] Generating trace-hw_dma.h with a custom command
[56/2951] Generating trace-hw_hppa.c with a custom command
[57/2951] Generating trace-hw_hyperv.c with a custom command
[58/2951] Generating trace-hw_i2c.c with a custom command
[59/2951] Generating trace-hw_block.c with a custom command
[60/2951] Generating trace-hw_hyperv.h with a custom command
[61/2951] Compiling C object subprojects/libvhost-user/libvhost-user-glib.a.p/libvhost-user-glib.c.o
[62/2951] Generating trace-hw_char.h with a custom command
[63/2951] Generating trace-hw_display.h with a custom command
[64/2951] Generating trace-hw_display.c with a custom command
[65/2951] Generating trace-hw_i2c.h with a custom command
[66/2951] Generating trace-hw_i386.c with a custom command
[67/2951] Generating trace-hw_i386_xen.c with a custom command
[68/2951] Generating trace-net.c with a custom command
[69/2951] Generating trace-hw_i386.h with a custom command
[70/2951] Generating trace-hw_i386_xen.h with a custom command
[71/2951] Generating trace-hw_mips.h with a custom command
[72/2951] Linking static target subprojects/libvhost-user/libvhost-user-glib.a
[73/2951] Generating trace-hw_input.c with a custom command
[74/2951] Generating trace-hw_isa.h with a custom command
[75/2951] Generating trace-hw_mem.h with a custom command
[76/2951] Generating trace-hw_isa.c with a custom command
[77/2951] Generating trace-hw_mem.c with a custom command
[78/2951] Generating trace-hw_mips.c with a custom command
[79/2951] Generating trace-hw_input.h with a custom command
[80/2951] Generating trace-hw_block.h with a custom command
[81/2951] Generating trace-hw_intc.c with a custom command
[82/2951] Generating trace-hw_misc_macio.h with a custom command
[83/2951] Generating trace-hw_ide.h with a custom command
[84/2951] Generating trace-hw_misc.c with a custom command
[85/2951] Generating trace-hw_misc_macio.c with a custom command
[86/2951] Generating trace-hw_net_can.c with a custom command
[87/2951] Generating trace-hw_nvram.h with a custom command
[88/2951] Generating trace-hw_nvram.c with a custom command
[89/2951] Generating trace-hw_net_can.h with a custom command
[90/2951] Generating trace-hw_pci.h with a custom command
[91/2951] Generating trace-hw_pci.c with a custom command
[92/2951] Generating trace-hw_pci_host.c with a custom command
[93/2951] Generating trace-hw_intc.h with a custom command
[94/2951] Generating trace-hw_misc.h with a custom command
[95/2951] Generating trace-hw_pci_host.h with a custom command
[96/2951] Generating trace-hw_ppc.h with a custom command
[97/2951] Generating trace-hw_ppc.c with a custom command
[98/2951] Generating trace-hw_rdma.h with a custom command
[99/2951] Generating trace-hw_rdma.c with a custom command
[100/2951] Generating trace-hw_rdma_vmw.h with a custom command
[101/2951] Generating trace-hw_rdma_vmw.c with a custom command
[102/2951] Generating trace-hw_rtc.h with a custom command
[103/2951] Generating trace-hw_rtc.c with a custom command
[104/2951] Generating trace-hw_net.c with a custom command
[105/2951] Generating trace-hw_s390x.h with a custom command
[106/2951] Generating trace-hw_sd.c with a custom command
[107/2951] Generating trace-hw_sparc.c with a custom command
[108/2951] Generating trace-hw_sparc64.c with a custom command
[109/2951] Generating trace-hw_tpm.c with a custom command
[110/2951] Generating trace-hw_sd.h with a custom command
[111/2951] Generating trace-hw_sparc.h with a custom command
[112/2951] Generating trace-hw_ssi.c with a custom command
[113/2951] Generating trace-hw_sparc64.h with a custom command
[114/2951] Generating trace-hw_ssi.h with a custom command
[115/2951] Generating trace-hw_timer.h with a custom command
[116/2951] Generating trace-hw_timer.c with a custom command
[117/2951] Generating trace-hw_tpm.h with a custom command
[118/2951] Generating trace-hw_virtio.c with a custom command
[119/2951] Generating trace-hw_watchdog.h with a custom command
[120/2951] Generating trace-hw_watchdog.c with a custom command
[121/2951] Generating trace-hw_gpio.c with a custom command
[122/2951] Generating trace-net.h with a custom command
[123/2951] Generating trace-hw_vfio.c with a custom command
[124/2951] Generating trace-hw_xen.c with a custom command
[125/2951] Generating trace-hw_gpio.h with a custom command
[126/2951] Generating qemu-version.h with a custom command (wrapped by meson to capture output)
[127/2951] Generating trace-hw_xen.h with a custom command
[128/2951] Generating trace-softmmu.c with a custom command
[129/2951] Generating trace-hw_remote.h with a custom command
[130/2951] Generating trace-softmmu.h with a custom command
[131/2951] Generating trace-hw_remote.c with a custom command
[132/2951] Generating qemu-img-cmds.h with a custom command (wrapped by meson to capture output)
[133/2951] Generating trace-accel_tcg.h with a custom command
[134/2951] Generating trace-hw_net.h with a custom command
[135/2951] Generating trace-hw_usb.c with a custom command
[136/2951] Generating trace-ui.c with a custom command
[137/2951] Generating trace-hw_vfio.h with a custom command
[138/2951] Generating trace-hw_virtio.h with a custom command
[139/2951] Generating trace-migration.c with a custom command
[140/2951] Generating trace-ui.h with a custom command
[141/2951] Generating trace-accel_tcg.c with a custom command
[142/2951] Generating trace-hw_core.c with a custom command
[143/2951] Generating trace-target_arm.h with a custom command
[144/2951] Generating trace-target_arm.c with a custom command
[145/2951] Generating trace-target_hppa.h with a custom command
[146/2951] Generating trace-hw_core.h with a custom command
[147/2951] Generating trace-target_hppa.c with a custom command
[148/2951] Generating trace-target_i386.h with a custom command
[149/2951] Generating trace-target_i386.c with a custom command
[150/2951] Generating trace-target_i386_kvm.h with a custom command
[151/2951] Generating trace-target_i386_kvm.c with a custom command
[152/2951] Generating trace-hw_usb.h with a custom command
[153/2951] Generating trace-target_mips.h with a custom command
[154/2951] Generating trace-target_mips.c with a custom command
[155/2951] Generating trace-target_ppc.c with a custom command
[156/2951] Generating trace-target_riscv.h with a custom command
[157/2951] Generating trace-target_riscv.c with a custom command
[158/2951] Generating trace-target_s390x.h with a custom command
[159/2951] Generating trace-target_s390x.c with a custom command
[160/2951] Generating hmp-commands-info.h with a custom command (wrapped by meson to capture output)
[161/2951] Generating trace-target_ppc.h with a custom command
[162/2951] Generating trace-target_sparc.h with a custom command
[163/2951] Generating hmp-commands.h with a custom command (wrapped by meson to capture output)
[164/2951] Generating trace-target_sparc.c with a custom command
[165/2951] Generating generated-tcg-tracers.h with a custom command
[166/2951] Generating generated-helpers.c with a custom command
[167/2951] Generating trace-migration.h with a custom command
[168/2951] Generating generated-helpers-wrappers.h with a custom command
[169/2951] Generating generated-helpers.h with a custom command
[170/2951] Generating module_block.h with a custom command
[171/2951] Generating block-gen.c with a custom command
[172/2951] Compiling C object tests/fp/libsoftfloat.a.p/berkeley-softfloat-3_source_f128M_to_i32_r_minMag.c.o
[173/2951] Compiling C object tests/fp/libsoftfloat.a.p/berkeley-softfloat-3_source_f128M_to_f32.c.o
[174/2951] Compiling C object tests/fp/libsoftfloat.a.p/berkeley-softfloat-3_source_f128M_to_i64_r_minMag.c.o
[175/2951] Compiling C object tests/fp/libsoftfloat.a.p/berkeley-softfloat-3_source_f128M_to_extF80M.c.o
[176/2951] Compiling C object tests/fp/libsoftfloat.a.p/berkeley-softfloat-3_source_f128M_roundToInt.c.o
[177/2951] Compiling C object tests/fp/libsoftfloat.a.p/berkeley-softfloat-3_source_f128M_sub.c.o
[178/2951] Compiling C object tests/fp/libsoftfloat.a.p/berkeley-softfloat-3_source_f128M_to_f16.c.o
[179/2951] Compiling C object tests/fp/libsoftfloat.a.p/berkeley-softfloat-3_source_f128M_mul.c.o
[180/2951] Generating qemu-options.def with a custom command (wrapped by meson to capture output)
[181/2951] Compiling C object tests/fp/libsoftfloat.a.p/berkeley-softfloat-3_source_f128M_to_f64.c.o
[182/2951] Compiling C object tests/fp/libsoftfloat.a.p/berkeley-softfloat-3_source_f128M_mulAdd.c.o
[183/2951] Compiling C object tests/fp/libsoftfloat.a.p/berkeley-softfloat-3_source_f128M_add.c.o
[184/2951] Compiling C object tests/fp/libsoftfloat.a.p/berkeley-softfloat-3_source_f128M_div.c.o
[185/2951] Compiling C object tests/fp/libsoftfloat.a.p/berkeley-softfloat-3_source_f128M_rem.c.o
[186/2951] Compiling C object tests/fp/libsoftfloat.a.p/berkeley-softfloat-3_source_f128M_eq.c.o
[187/2951] Generating 'libqemu-aarch64-softmmu.fa.p/decode-neon-ls.c.inc'.
[188/2951] Generating 'libqemu-aarch64-softmmu.fa.p/decode-a32-uncond.c.inc'.
[189/2951] Generating 'libqemu-aarch64-softmmu.fa.p/decode-vfp.c.inc'.
[190/2951] Generating 'libqemu-aarch64-softmmu.fa.p/decode-vfp-uncond.c.inc'.
[191/2951] Generating 'libqemu-aarch64-softmmu.fa.p/decode-t32.c.inc'.
[192/2951] Generating 'libqemu-aarch64-softmmu.fa.p/decode-sve.c.inc'.
[193/2951] Generating 'libqemu-aarch64-softmmu.fa.p/decode-t16.c.inc'.
[194/2951] Generating 'libqemu-aarch64-softmmu.fa.p/decode-neon-shared.c.inc'.
[195/2951] Generating 'libqemu-aarch64-softmmu.fa.p/decode-m-nocp.c.inc'.
[196/2951] Generating 'libqemu-aarch64-softmmu.fa.p/decode-a32.c.inc'.
[197/2951] Generating 'libqemu-aarch64-softmmu.fa.p/decode-neon-dp.c.inc'.
[198/2951] Generating trace-events-all with a custom command (wrapped by meson to capture output)
[199/2951] Generating texture-blit-vert.h with a custom command (wrapped by meson to capture output)
[200/2951] Generating texture-blit-frag.h with a custom command (wrapped by meson to capture output)
[201/2951] Compiling C object vma.p/vma-reader.c.o
FAILED: vma.p/vma-reader.c.o
cc -Ivma.p -I. -I.. -I/usr/include/glib-2.0 -I/usr/lib/x86_64-linux-gnu/glib-2.0/include -fdiagnostics-color=auto -pipe -Wall -Winvalid-pch -std=gnu99 -O2 -g -isystem /home/lae/build/pve-qemu/pve-qemu-kvm-6.0.0/linux-headers -isystem linux-headers -iquote . -iquote /home/lae/build/pve-qemu/pve-qemu-kvm-6.0.0 -iquote /home/lae/build/pve-qemu/pve-qemu-kvm-6.0.0/include -iquote /home/lae/build/pve-qemu/pve-qemu-kvm-6.0.0/disas/libvixl -iquote /home/lae/build/pve-qemu/pve-qemu-kvm-6.0.0/tcg/i386 -iquote /home/lae/build/pve-qemu/pve-qemu-kvm-6.0.0/accel/tcg -pthread -U_FORTIFY_SOURCE -D_FORTIFY_SOURCE=2 -m64 -mcx16 -D_GNU_SOURCE -D_FILE_OFFSET_BITS=64 -D_LARGEFILE_SOURCE -Wstrict-prototypes -Wredundant-decls -Wundef -Wwrite-strings -Wmissing-prototypes -fno-strict-aliasing -fno-common -fwrapv -Wold-style-declaration -Wold-style-definition -Wtype-limits -Wformat-security -Wformat-y2k -Winit-self -Wignored-qualifiers -Wempty-body -Wnested-externs -Wendif-labels -Wexpansion-to-defined -Wimplicit-fallthrough=2 -Wno-missing-include-dirs -Wno-shift-negative-value -Wno-psabi -fstack-protector-strong -fPIE -MD -MQ vma.p/vma-reader.c.o -MF vma.p/vma-reader.c.o.d -o vma.p/vma-reader.c.o -c ../vma-reader.c
In file included from ../vma.h:18,
                 from ../vma-reader.c:21:
/home/lae/build/pve-qemu/pve-qemu-kvm-6.0.0/include/qapi/error.h:275:10: fatal error: qapi/qapi-types-error.h: No such file or directory
  275 | #include "qapi/qapi-types-error.h"
      |          ^~~~~~~~~~~~~~~~~~~~~~~~~
compilation terminated.
[202/2951] Generating texture-blit-flip-vert.h with a custom command (wrapped by meson to capture output)
[203/2951] Generating input-keymap-qcode-to-sun.c.inc with a custom command (wrapped by meson to capture output)
[204/2951] Generating input-keymap-usb-to-qcode.c.inc with a custom command (wrapped by meson to capture output)
[205/2951] Generating input-keymap-qnum-to-qcode.c.inc with a custom command (wrapped by meson to capture output)
[206/2951] Generating input-keymap-qcode-to-atset3.c.inc with a custom command (wrapped by meson to capture output)
[207/2951] Generating input-keymap-xorgkbd-to-qcode.c.inc with a custom command (wrapped by meson to capture output)
[208/2951] Compiling C object pbs-restore.p/pbs-restore.c.o
FAILED: pbs-restore.p/pbs-restore.c.o
cc -Ipbs-restore.p -I. -I.. -I/usr/include/glib-2.0 -I/usr/lib/x86_64-linux-gnu/glib-2.0/include -fdiagnostics-color=auto -pipe -Wall -Winvalid-pch -std=gnu99 -O2 -g -isystem /home/lae/build/pve-qemu/pve-qemu-kvm-6.0.0/linux-headers -isystem linux-headers -iquote . -iquote /home/lae/build/pve-qemu/pve-qemu-kvm-6.0.0 -iquote /home/lae/build/pve-qemu/pve-qemu-kvm-6.0.0/include -iquote /home/lae/build/pve-qemu/pve-qemu-kvm-6.0.0/disas/libvixl -iquote /home/lae/build/pve-qemu/pve-qemu-kvm-6.0.0/tcg/i386 -iquote /home/lae/build/pve-qemu/pve-qemu-kvm-6.0.0/accel/tcg -pthread -U_FORTIFY_SOURCE -D_FORTIFY_SOURCE=2 -m64 -mcx16 -D_GNU_SOURCE -D_FILE_OFFSET_BITS=64 -D_LARGEFILE_SOURCE -Wstrict-prototypes -Wredundant-decls -Wundef -Wwrite-strings -Wmissing-prototypes -fno-strict-aliasing -fno-common -fwrapv -Wold-style-declaration -Wold-style-definition -Wtype-limits -Wformat-security -Wformat-y2k -Winit-self -Wignored-qualifiers -Wempty-body -Wnested-externs -Wendif-labels -Wexpansion-to-defined -Wimplicit-fallthrough=2 -Wno-missing-include-dirs -Wno-shift-negative-value -Wno-psabi -fstack-protector-strong -fPIE -MD -MQ pbs-restore.p/pbs-restore.c.o -MF pbs-restore.p/pbs-restore.c.o.d -o pbs-restore.p/pbs-restore.c.o -c ../pbs-restore.c
In file included from ../pbs-restore.c:24:
/home/lae/build/pve-qemu/pve-qemu-kvm-6.0.0/include/qapi/error.h:275:10: fatal error: qapi/qapi-types-error.h: No such file or directory
  275 | #include "qapi/qapi-types-error.h"
      |          ^~~~~~~~~~~~~~~~~~~~~~~~~
compilation terminated.
[209/2951] Generating input-keymap-win32-to-qcode.c.inc with a custom command (wrapped by meson to capture output)
[210/2951] Generating input-keymap-qcode-to-linux.c.inc with a custom command (wrapped by meson to capture output)
[211/2951] Generating input-keymap-xorgevdev-to-qcode.c.inc with a custom command (wrapped by meson to capture output)
[212/2951] Generating input-keymap-qcode-to-atset1.c.inc with a custom command (wrapped by meson to capture output)
[213/2951] Generating input-keymap-qcode-to-qnum.c.inc with a custom command (wrapped by meson to capture output)
[214/2951] Generating input-keymap-qcode-to-atset2.c.inc with a custom command (wrapped by meson to capture output)
[215/2951] Generating input-keymap-linux-to-qcode.c.inc with a custom command (wrapped by meson to capture output)
[216/2951] Generating input-keymap-osx-to-qcode.c.inc with a custom command (wrapped by meson to capture output)
[217/2951] Generating input-keymap-xorgxwin-to-qcode.c.inc with a custom command (wrapped by meson to capture output)
[218/2951] Generating input-keymap-xorgxquartz-to-qcode.c.inc with a custom command (wrapped by meson to capture output)
[219/2951] Compiling C object contrib/elf2dmp/elf2dmp.p/addrspace.c.o
[220/2951] Compiling C object vma.p/vma.c.o
FAILED: vma.p/vma.c.o
cc -Ivma.p -I. -I.. -I/usr/include/glib-2.0 -I/usr/lib/x86_64-linux-gnu/glib-2.0/include -fdiagnostics-color=auto -pipe -Wall -Winvalid-pch -std=gnu99 -O2 -g -isystem /home/lae/build/pve-qemu/pve-qemu-kvm-6.0.0/linux-headers -isystem linux-headers -iquote . -iquote /home/lae/build/pve-qemu/pve-qemu-kvm-6.0.0 -iquote /home/lae/build/pve-qemu/pve-qemu-kvm-6.0.0/include -iquote /home/lae/build/pve-qemu/pve-qemu-kvm-6.0.0/disas/libvixl -iquote /home/lae/build/pve-qemu/pve-qemu-kvm-6.0.0/tcg/i386 -iquote /home/lae/build/pve-qemu/pve-qemu-kvm-6.0.0/accel/tcg -pthread -U_FORTIFY_SOURCE -D_FORTIFY_SOURCE=2 -m64 -mcx16 -D_GNU_SOURCE -D_FILE_OFFSET_BITS=64 -D_LARGEFILE_SOURCE -Wstrict-prototypes -Wredundant-decls -Wundef -Wwrite-strings -Wmissing-prototypes -fno-strict-aliasing -fno-common -fwrapv -Wold-style-declaration -Wold-style-definition -Wtype-limits -Wformat-security -Wformat-y2k -Winit-self -Wignored-qualifiers -Wempty-body -Wnested-externs -Wendif-labels -Wexpansion-to-defined -Wimplicit-fallthrough=2 -Wno-missing-include-dirs -Wno-shift-negative-value -Wno-psabi -fstack-protector-strong -fPIE -MD -MQ vma.p/vma.c.o -MF vma.p/vma.c.o.d -o vma.p/vma.c.o -c ../vma.c
In file included from ../vma.h:18,
                 from ../vma.c:17:
/home/lae/build/pve-qemu/pve-qemu-kvm-6.0.0/include/qapi/error.h:275:10: fatal error: qapi/qapi-types-error.h: No such file or directory
  275 | #include "qapi/qapi-types-error.h"
      |          ^~~~~~~~~~~~~~~~~~~~~~~~~
compilation terminated.
[221/2951] Generating input-keymap-atset1-to-qcode.c.inc with a custom command (wrapped by meson to capture output)
[222/2951] Generating x86_64-softmmu-gdbstub-xml.c with a custom command (wrapped by meson to capture output)
[223/2951] Compiling C object contrib/elf2dmp/elf2dmp.p/download.c.o
[224/2951] Generating aarch64-softmmu-gdbstub-xml.c with a custom command (wrapped by meson to capture output)
[225/2951] Compiling C object contrib/elf2dmp/elf2dmp.p/qemu_elf.c.o
[226/2951] Generating input-keymap-x11-to-qcode.c.inc with a custom command (wrapped by meson to capture output)
[227/2951] Compiling C object contrib/elf2dmp/elf2dmp.p/pdb.c.o
[228/2951] Compiling C object contrib/elf2dmp/elf2dmp.p/main.c.o
[229/2951] Compiling C object subprojects/libvhost-user/libvhost-user.a.p/libvhost-user.c.o
[230/2951] Compiling C object contrib/ivshmem-client/ivshmem-client.p/ivshmem-client.c.o
[231/2951] Generating edk2-arm-vars.fd with a custom command (wrapped by meson to capture output)
[232/2951] Generating QAPI files for qemu-storage-daemon with a custom command
[233/2951] Generating shared QAPI source files with a custom command
[234/2951] Generating edk2-arm-code.fd with a custom command (wrapped by meson to capture output)
ninja: build stopped: subcommand failed.
make[3]: *** [Makefile:152: run-ninja] Error 1
make[3]: Leaving directory '/home/lae/build/pve-qemu/pve-qemu-kvm-6.0.0/build'
make[2]: *** [GNUmakefile:11: all] Error 2
make[2]: Leaving directory '/home/lae/build/pve-qemu/pve-qemu-kvm-6.0.0'
make[1]: *** [debian/rules:87: build-stamp] Error 2
make[1]: Leaving directory '/home/lae/build/pve-qemu/pve-qemu-kvm-6.0.0'
dpkg-buildpackage: error: debian/rules build subprocess returned exit status 2
make: *** [Makefile:36: pve-qemu-kvm_6.0.0-3_amd64.deb] Error 2
-------------- next part --------------
A non-text attachment was scrubbed...
Name: OpenPGP_signature
Type: application/pgp-signature
Size: 236 bytes
Desc: OpenPGP digital signature
URL: <http://lists.proxmox.com/pipermail/pve-user/attachments/20210829/47e2d403/attachment-0001.sig>


More information about the pve-user mailing list