[pve-devel] make error in corosync/trunk

Seth Lauzon seth.lauzon at gmail.com
Fri Jul 22 16:57:07 CEST 2011


root at pve2:/usr/local/src/pve/corosync/trunk# make dinstall
echo corosync-pve_1.4.0-1_amd64.deb libcorosync4-pve_1.4.0-1_amd64.deb libcorosync-pve-dev_1.4.0-1_amd64.deb
corosync-pve_1.4.0-1_amd64.deb libcorosync4-pve_1.4.0-1_amd64.deb libcorosync-pve-dev_1.4.0-1_amd64.deb
rm -rf corosync-1.4.0
tar xf corosync-1.4.0.orig.tar.gz 
cp -a debian corosync-1.4.0/debian
cd corosync-1.4.0; dpkg-buildpackage -rfakeroot -b -us -uc
dpkg-buildpackage: warning: using a gain-root-command while being root
dpkg-buildpackage: export CFLAGS from dpkg-buildflags (origin: vendor): -g -O2
dpkg-buildpackage: export CPPFLAGS from dpkg-buildflags (origin: vendor): 
dpkg-buildpackage: export CXXFLAGS from dpkg-buildflags (origin: vendor): -g -O2
dpkg-buildpackage: export FFLAGS from dpkg-buildflags (origin: vendor): -g -O2
dpkg-buildpackage: export LDFLAGS from dpkg-buildflags (origin: vendor): 
dpkg-buildpackage: source package corosync-pve
dpkg-buildpackage: source version 1.4.0-1
dpkg-buildpackage: source changed by Proxmox Support Team <support at proxmox.com>
dpkg-buildpackage: host architecture amd64
 dpkg-source --before-build corosync-1.4.0
 fakeroot debian/rules clean
make[1]: Entering directory `/usr/local/src/pve/corosync/trunk/corosync-1.4.0'
QUILT_PATCHES=debian/patches \
		quilt --quiltrc /dev/null pop -a -R || test $? = 2
No patch removed
rm -rf .pc debian/stamp-patched
dh_testdir
dh_testroot
rm -f build-stamp 
# Add here commands to clean up after the build process.
[ ! -f Makefile ] || /usr/bin/make distclean
rm -f config.sub config.guess
dh_clean 
make[1]: Leaving directory `/usr/local/src/pve/corosync/trunk/corosync-1.4.0'
 debian/rules build
make[1]: Entering directory `/usr/local/src/pve/corosync/trunk/corosync-1.4.0'
QUILT_PATCHES=debian/patches \
		quilt --quiltrc /dev/null push -a || test $? = 2
No patches in series
make[1]: *** [debian/stamp-patched] Error 1
make[1]: Leaving directory `/usr/local/src/pve/corosync/trunk/corosync-1.4.0'
dpkg-buildpackage: error: debian/rules build gave error exit status 2
make: *** [corosync-pve_1.4.0-1_amd64.deb] Error 2

Can you help troubleshoot this?

Thanks,
Seth



More information about the pve-devel mailing list